{"text_format":"1","workbook":"xlsx","n_sheets":15,"sheets":["Intro","Inhoud","Vragenlijst","Partners","data","hulp","sleutels","dataTotaal","dataPartners","dataTabellen","beantwoord - niet beantwoord","linkjes","dataMateriaal","dataReparatie","DataBekendheid"],"not_rendered":{"charts":0,"images":3,"macros":1,"external_links":0,"defined_names":10,"comments":7,"pivot_tables":0},"unopened":[],"bounds":{"document_bytes":16777216,"sheet_cells":100000,"rows_first":2000,"rows_last":500,"rows_between":2000,"halvings":0,"cell_chars":16384,"cell_head_chars":4096},"cells_cut":0,"cells_raw":0,"read":"whole","date_system":"1900"}

{"sheet":"Intro","index":0,"n_rows":55,"n_cols":16,"rows_kept":55,"cut":false,"hidden":false,"merged":[[9,1,10,14],[44,3,45,19],[13,1,21,19],[25,1,26,19],[50,8,50,12]]}
[]
[]
[]
[]
[]
[null,null,null,null,null,null,null,null,null,null,null,null,"MONITOR",null,null,{"$f":"RIGHT(Vragenlijst!M7,4)","v":"2025"}]
[]
[]
[]
[null,"Introductie en handleiding"]
[]
[]
[]
[null,"Met deze monitoringsvragenlijst van het programma Circulaire Ambachtscentra brengt Rijkswaterstaat de voortgang van het programma in beeld. Voor het rapportagejaar 2025 doen we een nulmeting. We nodigen je daarom uit om de vragenlijst voor jouw circulair ambachtscentrum in te vullen. Het invullen kost ongeveer 30 minuten.\n\nDe vragen zijn vooral kwalitatief van aard. Per circulair ambachtscentrum vul je één vragenlijst in. Ben je contactpersoon voor meerdere circulaire ambachtscentra? Dan vragen we je om voor elk ambachtscentrum een aparte vragenlijst in te vullen, zodat we een compleet beeld krijgen.\n\nDe vragenlijst is bedoeld voor alle onderdelen van het circulair ambachtscentrum samen. Is er een fusie vóór 2025 geweest? Dan hoef je uiteraard maar één vragenlijst in te vullen."]
[]
[]
[]
[]
[]
[]
[]
[]
[null,"Je kunt de vragenlijst",null,null,null,"hier","uploaden. Het is handig om zelf ook een kopie op te slaan in je eigen administratie."]
[]
[null,"Daarnaast ontvangen we graag aanvullende kwantitatieve informatie via de uploadmogelijkheid."]
[null,"Deze gegevens gebruiken we om de monitor de komende jaren verder te verbeteren en aan te scherpen."]
[]
[]
[null,"Tabbladen"]
[null,"Intro",null,null,"Het huidige tabblad met een toelichting bij de vragenlijst."]
[null,"Inhoud",null,null,"De inhoudsopgave met vragen, voorzien van hyperlinks om snel te kunnen navigeren."]
[null,"Vragenlijst",null,null,"De vragen om in te vullen."]
[null,"Partners",null,null,"Het tabblad behorende bij de vragen 8 en 9 om meer dan 30 partners op te geven."]
[]
[null,"Legenda voor de vragenlijst"]
[]
[null,null,null,"Lichtblauwe velden zijn invoervelden."]
[]
[null,null,null,"Meerkeuze antwoorden, hier kunt u meerdere boxen aanvinken."]
[]
[null,null,null,"Dit is een keuzerondje. U kunt hier één optie selecteren. Deselecteren is niet mogelijk door er opnieuw op te klikken. U moet een ander keuzerondje in dezelfde groep selecteren."]
[]
[null,null,null,"Een klein rood driehoek boven rechts: als u met de muis hierover gaat, dan kunt u een toelichting lezen."]
[]
[null,"link",null,"Als je bepaalde antwoordmogelijkheden wel of niet aankruist, kan een melding verschijnen. De melding geeft een aanwijzing naar welke vraag je moet gaan, inclusief een link naar de cel waar de vraag begint."]
[]
[]
[null,null,null,"Lichtgroene velden kunt u niet bewerken. Hier komt eerder door u ingevulde data te staan, bijvoorbeeld een lijst van kringloopwinkels."]
[]
[]
[null,"Vragen? Neem contact op via ons contactformulier: ",null,null,null,null,null,null,"https://circulairambachtscentrum.nl/contact/"]
[]
[]
[]
[null,"versie 1.9",null,null,"2026-02-06"]

{"sheet":"Inhoud","index":1,"n_rows":88,"n_cols":21,"rows_kept":88,"cut":false,"hidden":false,"merged":[[59,2,59,16],[60,2,60,16],[64,2,65,16],[87,2,87,16],[66,2,66,16],[67,2,67,16],[68,2,68,16],[69,2,69,16],[70,2,70,16],[71,2,71,16],[83,2,83,16],[79,2,79,16],[80,2,80,16],[75,2,75,16],[76,2,76,16],[74,2,74,16],[84,2,84,16],[40,2,40,17],[55,2,55,16],[56,2,56,16],[63,2,63,16],[42,2,42,17],[45,2,45,17],[46,2,46,17],[47,2,47,17],[48,2,48,17],[52,2,52,16],[53,2,53,16],[54,2,54,16],[41,2,41,17],[51,2,51,16],[57,2,57,16],[58,2,58,16],[36,2,36,17],[37,2,37,17],[38,2,38,17],[39,2,39,17],[35,2,35,17],[34,2,34,17],[31,2,31,17],[13,2,13,17],[16,2,16,17],[17,2,17,17],[22,2,22,17],[23,2,23,17],[26,2,26,17],[27,2,27,17],[28,2,28,17],[6,2,6,17],[7,2,7,17],[8,2,8,17],[9,2,9,17],[12,2,12,17],[5,19,5,22],[11,19,11,22],[15,19,15,22],[21,19,21,22],[25,19,25,22],[30,19,30,22],[33,19,33,22],[44,19,44,22],[50,19,50,22],[62,19,62,22],[64,20,65,20],[73,19,73,22],[82,19,82,22],[78,19,78,22],[86,19,86,22]]}
[]
[null,"Inhoud",null,"Hier kunt u doorklikken naar specifieke vragen en ziet u welke vragen u al wel of nog niet heeft ingevuld."]
[]
[null,{"$f":"Vragenlijst!B5","v":"Onderzoeksperiode"},null,null,{"$f":"Vragenlijst!M7","v":"1.1.2025 - 31.12.2025"}]
[]
[null,{"$f":"Vragenlijst!B11","v":"Organisatiegegevens "},null,null,null,null,null,null,null,null,null,null,null,null,null,null,null,null,null,"Ingevuld?"]
[null,{"$f":"Vragenlijst!B13","v":1},{"$f":"Vragenlijst!C13","v":"Wat is de naam van het circulaire ambachtscentrum? "},null,null,null,null,null,null,null,null,null,null,null,null,null,null,null,null,null,{"$f":"VLOOKUP(B7,'beantwoord - niet beantwoord'!$B$3:$C$56,2,FALSE)","v":0}]
[null,{"$f":"Vragenlijst!B15","v":2},{"$f":"Vragenlijst!C15","v":"Wie is de contactpersoon voor het invullen van deze vragenlijst?"},null,null,null,null,null,null,null,null,null,null,null,null,null,null,null,null,null,{"$f":"VLOOKUP(B8,'beantwoord - niet beantwoord'!$B$3:$C$56,2,FALSE)","v":0}]
[null,{"$f":"Vragenlijst!B22","v":3},{"$f":"Vragenlijst!C22","v":"In welk ontwikkelstadium bevindt  zich op 31.12.2025?"},null,null,null,null,null,null,null,null,null,null,null,null,null,null,null,null,null,{"$f":"VLOOKUP(B9,'beantwoord - niet beantwoord'!$B$3:$C$56,2,FALSE)","v":0}]
[null,{"$f":"Vragenlijst!B29","v":4},{"$f":"Vragenlijst!C29","v":"Met welke gemeenten werkt  samen?"},null,null,null,null,null,null,null,null,null,null,null,null,null,null,null,null,null,{"$f":"VLOOKUP(B10,'beantwoord - niet beantwoord'!$B$3:$C$56,2,FALSE)","v":0}]
[]
[null,{"$f":"Vragenlijst!B41","v":"Doelstellingen en ambities"},null,null,null,null,null,null,null,null,null,null,null,null,null,null,null,null,null,"Ingevuld?"]
[null,{"$f":"Vragenlijst!B43","v":5},{"$f":"Vragenlijst!C43","v":"Wat zijn de belangrijkste doelstellingen van ? "},null,null,null,null,null,null,null,null,null,null,null,null,null,null,null,null,null,{"$f":"VLOOKUP(B13,'beantwoord - niet beantwoord'!$B$3:$C$56,2,FALSE)","v":0}]
[null,{"$f":"Vragenlijst!B53","v":6},{"$f":"Vragenlijst!C53","v":"Wat is volgens jou en de betrokken partners de meerwaarde van samenwerken binnen een circulair ambachtscentrum, vergeleken met werken als losse organisaties?"},null,null,null,null,null,null,null,null,null,null,null,null,null,null,null,null,null,{"$f":"VLOOKUP(B14,'beantwoord - niet beantwoord'!$B$3:$C$56,2,FALSE)","v":0}]
[]
[null,{"$f":"Vragenlijst!B61","v":"Structuur en aangesloten organisaties"},null,null,null,null,null,null,null,null,null,null,null,null,null,null,null,null,null,"Ingevuld?"]
[null,{"$f":"Vragenlijst!B63","v":7},{"$f":"Vragenlijst!C63","v":"Wat is de structuur van ?"},null,null,null,null,null,null,null,null,null,null,null,null,null,null,null,null,null,{"$f":"VLOOKUP(B17,'beantwoord - niet beantwoord'!$B$3:$C$56,2,FALSE)","v":0}]
[null,{"$f":"Vragenlijst!B73","v":8},{"$f":"Vragenlijst!C73","v":"Welke partners van  zijn aangesloten op 31.12.2025?"},null,null,null,null,null,null,null,null,null,null,null,null,null,null,null,null,null,{"$f":"VLOOKUP(B18,'beantwoord - niet beantwoord'!$B$3:$C$56,2,FALSE)","v":0}]
[null,{"$f":"Vragenlijst!B120","v":9},{"$f":"Vragenlijst!C120","v":"Zijn er partners die ook bij een andere bouwsteen passen? Zo ja, welke?"},null,null,null,null,null,null,null,null,null,null,null,null,null,null,null,null,null,{"$f":"VLOOKUP(B19,'beantwoord - niet beantwoord'!$B$3:$C$56,2,FALSE)","v":0}]
[null,{"$f":"Vragenlijst!B162","v":10},{"$f":"Vragenlijst!C162","v":"Werkt   samen met regionale ontwikkel- en werkcentra?"},null,null,null,null,null,null,null,null,null,null,null,null,null,null,null,null,null,{"$f":"VLOOKUP(B20,'beantwoord - niet beantwoord'!$B$3:$C$56,2,FALSE)","v":0}]
[]
[null,{"$f":"Vragenlijst!B167","v":"Materiaalstromen"},null,null,null,null,null,null,null,null,null,null,null,null,null,null,null,null,null,"Ingevuld?"]
[null,{"$f":"Vragenlijst!B169","v":11},{"$f":"Vragenlijst!C169","v":"Welke bouwstenen van  dragen bij aan levensduurverlenging van de volgende materialen/productgroepen?"},null,null,null,null,null,null,null,null,null,null,null,null,null,null,null,null,null,{"$f":"VLOOKUP(B23,'beantwoord - niet beantwoord'!$B$3:$C$56,2,FALSE)","v":0}]
[null,{"$f":"Vragenlijst!B186","v":12},{"$f":"Vragenlijst!C186","v":"Welke handelingen worden per materiaal/productgroep uitgevoerd?"},null,null,null,null,null,null,null,null,null,null,null,null,null,null,null,null,null,{"$f":"VLOOKUP(B24,'beantwoord - niet beantwoord'!$B$3:$C$56,2,FALSE)","v":0}]
[]
[null,{"$f":"Vragenlijst!B202","v":"Milieustraat"},null,null,null,null,null,null,null,null,null,null,null,null,null,null,null,null,null,"Ingevuld?"]
[null,{"$f":"Vragenlijst!B204","v":13},{"$f":"Vragenlijst!C204","v":"Hoeveel milieustraten heeft de deelnemende gemeente/hebben de deelnemende gemeenten in totaal?"},null,null,null,null,null,null,null,null,null,null,null,null,null,null,null,null,null,{"$f":"VLOOKUP(B27,'beantwoord - niet beantwoord'!$B$3:$C$56,2,FALSE)","v":0}]
[null,{"$f":"Vragenlijst!B206","v":14},{"$f":"Vragenlijst!C206","v":"Hoeveel van deze milieustraten zijn aangesloten bij ?"},null,null,null,null,null,null,null,null,null,null,null,null,null,null,null,null,null,{"$f":"VLOOKUP(B28,'beantwoord - niet beantwoord'!$B$3:$C$56,2,FALSE)","v":0}]
[null,{"$f":"Vragenlijst!B215","v":15},{"$f":"Vragenlijst!C215","v":"Welke voorzieningen zijn op de milieustraat aanwezig om hergebruik te stimuleren?"},null,null,null,null,null,null,null,null,null,null,null,null,null,null,null,null,null,{"$f":"VLOOKUP(B29,'beantwoord - niet beantwoord'!$B$3:$C$56,2,FALSE)","v":0}]
[]
[null,{"$f":"Vragenlijst!B227","v":"Kringloop- en weggeefwinkels"},null,null,null,null,null,null,null,null,null,null,null,null,null,null,null,null,null,"Ingevuld?"]
[null,{"$f":"Vragenlijst!B229","v":16},{"$f":"Vragenlijst!C229","v":"Welke kringlooporganisaties binnen  zijn lid van Branchevereniging Kringloop Nederland (BKN)?"},null,null,null,null,null,null,null,null,null,null,null,null,null,null,null,null,null,{"$f":"VLOOKUP(B32,'beantwoord - niet beantwoord'!$B$3:$C$56,2,FALSE)","v":{"$error":"#VALUE!"}}]
[]
[null,{"$f":"Vragenlijst!B248","v":"Repareren"},null,null,null,null,null,null,null,null,null,null,null,null,null,null,null,null,null,"Ingevuld?"]
[null,{"$f":"Vragenlijst!B254","v":17},{"$f":"Vragenlijst!C254","v":"Waar vinden reparaties plaats bij , en wie zijn de klanten (particulier of/en zakelijk)?"},null,null,null,null,null,null,null,null,null,null,null,null,null,null,null,null,null,{"$f":"VLOOKUP(B35,'beantwoord - niet beantwoord'!$B$3:$C$56,2,FALSE)","v":0}]
[null,{"$f":"Vragenlijst!B268","v":18},{"$f":"Vragenlijst!C268","v":"Betalen particulieren voor de reparatieservice?"},null,null,null,null,null,null,null,null,null,null,null,null,null,null,null,null,null,{"$f":"VLOOKUP(B36,'beantwoord - niet beantwoord'!$B$3:$C$56,2,FALSE)","v":0}]
[null,{"$f":"Vragenlijst!B277","v":19},{"$f":"Vragenlijst!C277","v":"Hoe werkt de reparatieservice voor particulieren?"},null,null,null,null,null,null,null,null,null,null,null,null,null,null,null,null,null,{"$f":"VLOOKUP(B37,'beantwoord - niet beantwoord'!$B$3:$C$56,2,FALSE)","v":0}]
[null,{"$f":"Vragenlijst!B287","v":20},{"$f":"Vragenlijst!C287","v":"Hoeveel Repair Café locaties zijn aangesloten bij ?"},null,null,null,null,null,null,null,null,null,null,null,null,null,null,null,null,null,{"$f":"VLOOKUP(B38,'beantwoord - niet beantwoord'!$B$3:$C$56,2,FALSE)","v":0}]
[null,{"$f":"Vragenlijst!B289","v":21},{"$f":"Vragenlijst!C289","v":"Hoe vaak is het Repair Café geopend?"},null,null,null,null,null,null,null,null,null,null,null,null,null,null,null,null,null,{"$f":"VLOOKUP(B39,'beantwoord - niet beantwoord'!$B$3:$C$56,2,FALSE)","v":0}]
[null,{"$f":"Vragenlijst!B301","v":22},{"$f":"Vragenlijst!C301","v":"Worden de reparaties geregistreerd? (Bijvoorbeeld productcategorieën, wel of niet geslaagde reparatie, aantallen, reden van defect, etc.)"},null,null,null,null,null,null,null,null,null,null,null,null,null,null,null,null,null,{"$f":"VLOOKUP(B40,'beantwoord - niet beantwoord'!$B$3:$C$56,2,FALSE)","v":0}]
[null,{"$f":"Vragenlijst!#REF!","v":{"$error":"#REF!"}},{"$f":"Vragenlijst!#REF!","v":{"$error":"#REF!"}},null,null,null,null,null,null,null,null,null,null,null,null,null,null,null,null,null,{"$f":"VLOOKUP(B41,'beantwoord - niet beantwoord'!$B$3:$C$56,2,FALSE)","v":{"$error":"#REF!"}}]
[null,{"$f":"Vragenlijst!B313","v":23},{"$f":"Vragenlijst!C313","v":"Welke reparatie-initiatieven binnen  zijn gestart, lopen door of zijn gestopt? Licht kort toe."},null,null,null,null,null,null,null,null,null,null,null,null,null,null,null,null,null,{"$f":"VLOOKUP(B42,'beantwoord - niet beantwoord'!$B$3:$C$56,2,FALSE)","v":0}]
[null,{"$f":"Vragenlijst!B331","v":24},{"$f":"Vragenlijst!C331","v":"Waarom zijn bepaalde reparatie initiatieven gestopt?"},null,null,null,null,null,null,null,null,null,null,null,null,null,null,null,null,null,{"$f":"VLOOKUP(B43,'beantwoord - niet beantwoord'!$B$3:$C$56,2,FALSE)","v":0}]
[]
[null,{"$f":"Vragenlijst!B341","v":"Onderwijs en scholing"},null,null,null,null,null,null,null,null,null,null,null,null,null,null,null,null,null,"Ingevuld?"]
[null,{"$f":"Vragenlijst!B343","v":25},{"$f":"Vragenlijst!C343","v":"Met welke soorten onderwijsinstellingen werkt  samen?"},null,null,null,null,null,null,null,null,null,null,null,null,null,null,null,null,null,{"$f":"VLOOKUP(B46,'beantwoord - niet beantwoord'!$B$3:$C$56,2,FALSE)","v":0}]
[null,{"$f":"Vragenlijst!B357","v":26},{"$f":"Vragenlijst!C357","v":"Op welke thema’s van de R-ladder wordt samengewerkt of zijn cursussen ontwikkeld?"},null,null,null,null,null,null,null,null,null,null,null,null,null,null,null,null,null,{"$f":"VLOOKUP(B47,'beantwoord - niet beantwoord'!$B$3:$C$56,2,FALSE)","v":0}]
[null,{"$f":"Vragenlijst!B373","v":27},{"$f":"Vragenlijst!C373","v":"Voor welke productgroepen biedt  een reparatieopleiding of reparatiecursussen aan?"},null,null,null,null,null,null,null,null,null,null,null,null,null,null,null,null,null,{"$f":"VLOOKUP(B48,'beantwoord - niet beantwoord'!$B$3:$C$56,2,FALSE)","v":0}]
[null,{"$f":"Vragenlijst!B380","v":28},{"$f":"Vragenlijst!C380","v":"Voor welke doelgroepen zijn deze opleidingen of cursussen bedoeld?"},null,null,null,null,null,null,null,null,null,null,null,null,null,null,null,null,null,{"$f":"VLOOKUP(B49,'beantwoord - niet beantwoord'!$B$3:$C$56,2,FALSE)","v":0}]
[]
[null,{"$f":"Vragenlijst!B391","v":"Inclusief werkgeverschap"},null,null,null,null,null,null,null,null,null,null,null,null,null,null,null,null,null,"Ingevuld?"]
[null,{"$f":"Vragenlijst!B405","v":29},{"$f":"Vragenlijst!C405","v":"Voor welke doelgroepen biedt  werkgelegenheid?"},null,null,null,null,null,null,null,null,null,null,null,null,null,null,null,null,null,{"$f":"VLOOKUP(B52,'beantwoord - niet beantwoord'!$B$3:$C$56,2,FALSE)","v":0}]
[null,{"$f":"Vragenlijst!B414","v":30},{"$f":"Vragenlijst!C414","v":"Heeft  bijgedragen aan doorstroom naar betaald werk (binnen of buiten de organisatie)?"},null,null,null,null,null,null,null,null,null,null,null,null,null,null,null,null,null,{"$f":"VLOOKUP(B53,'beantwoord - niet beantwoord'!$B$3:$C$56,2,FALSE)","v":0}]
[null,{"$f":"Vragenlijst!B418","v":31},{"$f":"Vragenlijst!C418","v":"Welke initiatieven voor inclusief werkgeverschap zijn binnen  gestart, lopen door of zijn gestopt? Licht kort toe."},null,null,null,null,null,null,null,null,null,null,null,null,null,null,null,null,null,{"$f":"VLOOKUP(B54,'beantwoord - niet beantwoord'!$B$3:$C$56,2,FALSE)","v":0}]
[null,{"$f":"Vragenlijst!B437","v":32},{"$f":"Vragenlijst!C437","v":"Waarom zijn bepaalde initiatieven voor inclusief werkgeverschap gestopt? Licht kort toe waarom:"},null,null,null,null,null,null,null,null,null,null,null,null,null,null,null,null,null,{"$f":"VLOOKUP(B55,'beantwoord - niet beantwoord'!$B$3:$C$56,2,FALSE)","v":"nvt"}]
[null,{"$f":"Vragenlijst!B446","v":33},{"$f":"Vragenlijst!C446","v":"Bij welke partners van  zijn vrijwilligers betrokken bij activiteiten van het ambachtscentrum?"},null,null,null,null,null,null,null,null,null,null,null,null,null,null,null,null,null,{"$f":"VLOOKUP(B56,'beantwoord - niet beantwoord'!$B$3:$C$56,2,FALSE)","v":0}]
[null,{"$f":"Vragenlijst!B462","v":34},{"$f":"Vragenlijst!C462","v":"Geef per sociale partner aan wat voor soort organisatie dit is."},null,null,null,null,null,null,null,null,null,null,null,null,null,null,null,null,null,{"$f":"VLOOKUP(B57,'beantwoord - niet beantwoord'!$B$3:$C$56,2,FALSE)","v":{"$error":"#VALUE!"}}]
[null,{"$f":"Vragenlijst!B479","v":35},{"$f":"Vragenlijst!C479","v":"Geef per sociale partner aan of deze lid is van Cedris op 31.12.2025."},null,null,null,null,null,null,null,null,null,null,null,null,null,null,null,null,null,{"$f":"VLOOKUP(B58,'beantwoord - niet beantwoord'!$B$3:$C$56,2,FALSE)","v":{"$error":"#VALUE!"}}]
[null,{"$f":"Vragenlijst!B496","v":36},{"$f":"Vragenlijst!C496","v":"Hoe veel FTE uit de PSO-doelgroep werkte mee aan activiteiten van  op 31.12.2024 en op 31.12.2025?"},null,null,null,null,null,null,null,null,null,null,null,null,null,null,null,null,null,{"$f":"VLOOKUP(B59,'beantwoord - niet beantwoord'!$B$3:$C$56,2,FALSE)","v":0}]
[null,{"$f":"Vragenlijst!B509","v":37},{"$f":"Vragenlijst!C509","v":"Hoeveel personen vanuit werkontwikkelbedrijven werkten in het ambachtscentrum op 31.12.2024 en op 31.12.2025?"},null,null,null,null,null,null,null,null,null,null,null,null,null,null,null,null,null,{"$f":"VLOOKUP(B60,'beantwoord - niet beantwoord'!$B$3:$C$56,2,FALSE)","v":0}]
[null,{"$f":"Vragenlijst!B515","v":38},{"$f":"Vragenlijst!C515","v":"Hoe veel leerwerktrajecten biedt  aan in 2025?"},null,null,null,null,null,null,null,null,null,null,null,null,null,null,null,null,null,{"$f":"VLOOKUP(B61,'beantwoord - niet beantwoord'!$B$3:$C$56,2,FALSE)","v":0}]
[]
[null,{"$f":"Vragenlijst!B534","v":"Economisch"},null,null,null,null,null,null,null,null,null,null,null,null,null,null,null,null,null,"Ingevuld?"]
[null,{"$f":"Vragenlijst!B536","v":39},{"$f":"Vragenlijst!C536","v":"Welke diensten biedt  aan voor particuliere en zakelijke klanten?"},null,null,null,null,null,null,null,null,null,null,null,null,null,null,null,null,null,{"$f":"VLOOKUP(B64,'beantwoord - niet beantwoord'!$B$3:$C$56,2,FALSE)","v":0}]
[null,{"$f":"Vragenlijst!B560","v":40},{"$f":"Vragenlijst!C560","v":"Wat is in 2025 de verhouding tussen Business to Business (B2B-), en Business to Consumer (B2C-) omzet van de 5 grootste ondernemende partners van ?"},null,null,null,null,null,null,null,null,null,null,null,null,null,null,null,null,null,{"$f":"VLOOKUP(B65,'beantwoord - niet beantwoord'!$B$3:$C$56,2,FALSE)","v":0}]
[]
[null,{"$f":"Vragenlijst!B574","v":41},{"$f":"Vragenlijst!C574","v":"Maak(te)  gebruik van impuls-/start up subsidies in 2025?"},null,null,null,null,null,null,null,null,null,null,null,null,null,null,null,null,null,{"$f":"VLOOKUP(B67,'beantwoord - niet beantwoord'!$B$3:$C$56,2,FALSE)","v":0}]
[null,{"$f":"Vragenlijst!B585","v":42},{"$f":"Vragenlijst!C585","v":"Maak(te)  vóór 2025 gebruik van dergelijke subsidies, dus in 2024 of eerdere jaren?"},null,null,null,null,null,null,null,null,null,null,null,null,null,null,null,null,null,{"$f":"VLOOKUP(B68,'beantwoord - niet beantwoord'!$B$3:$C$56,2,FALSE)","v":0}]
[null,{"$f":"Vragenlijst!B598","v":43},{"$f":"Vragenlijst!C598","v":"Was  in 2025 afhankelijk van deze subsidie(s) voor….?"},null,null,null,null,null,null,null,null,null,null,null,null,null,null,null,null,null,{"$f":"VLOOKUP(B69,'beantwoord - niet beantwoord'!$B$3:$C$56,2,FALSE)","v":0}]
[null,{"$f":"Vragenlijst!B606","v":44},{"$f":"Vragenlijst!C606","v":"Hoe goed is de structurele financering van  richting 2031 geborgd?"},null,null,null,null,null,null,null,null,null,null,null,null,null,null,null,null,null,{"$f":"VLOOKUP(B70,'beantwoord - niet beantwoord'!$B$3:$C$56,2,FALSE)","v":0}]
[null,{"$f":"Vragenlijst!B615","v":45},{"$f":"Vragenlijst!C615","v":"Heeft een vertegenwoordiger van  deelgenomen aan de cursus 'value cases voor circulaire ambachtscentra'?"},null,null,null,null,null,null,null,null,null,null,null,null,null,null,null,null,null,{"$f":"VLOOKUP(B71,'beantwoord - niet beantwoord'!$B$3:$C$56,2,FALSE)","v":0}]
[null,{"$f":"Vragenlijst!B619","v":46},{"$f":"Vragenlijst!C619","v":"Is  al bezig met het in beeld brengen van de value case? Dit houdt in dat u de sociale en ecologische meerwaarde van uw circulaire ambachtscentrum al in cijfers heeft kunnen uitdrukken."},null,null,null,null,null,null,null,null,null,null,null,null,null,null,null,null,null,{"$f":"VLOOKUP(B72,'beantwoord - niet beantwoord'!$B$3:$C$56,2,FALSE)","v":0}]
[]
[null,{"$f":"Vragenlijst!B628","v":"Bekendheid bij publiek"},null,null,null,null,null,null,null,null,null,null,null,null,null,null,null,null,null,"Ingevuld?"]
[null,{"$f":"Vragenlijst!B630","v":47},{"$f":"Vragenlijst!C630","v":"Is  online aanwezig op één of meerdere kanalen?"},null,null,null,null,null,null,null,null,null,null,null,null,null,null,null,null,null,{"$f":"VLOOKUP(B75,'beantwoord - niet beantwoord'!$B$3:$C$56,2,FALSE)","v":0}]
[null,{"$f":"Vragenlijst!B646","v":48},{"$f":"Vragenlijst!C646","v":"Hoe veel berichten zijn over  in 2024 en 2025 gepubliceerd?"},null,null,null,null,null,null,null,null,null,null,null,null,null,null,null,null,null,{"$f":"VLOOKUP(B76,'beantwoord - niet beantwoord'!$B$3:$C$56,2,FALSE)","v":0}]
[null,{"$f":"Vragenlijst!B657","v":49},{"$f":"Vragenlijst!C658","v":"De vragen 47 en 48 zijn indirecte indicatoren. Wordt bij  de bekendheid onder het publiek op een andere manier gemeten? Zo ja, hoe?"},null,null,null,null,null,null,null,null,null,null,null,null,null,null,null,null,null,{"$f":"VLOOKUP(B77,'beantwoord - niet beantwoord'!$B$3:$C$56,2,FALSE)","v":0}]
[]
[null,{"$f":"Vragenlijst!B665","v":"Terugkoppeling en benchmark"},null,null,null,null,null,null,null,null,null,null,null,null,null,null,null,null,null,"Ingevuld?"]
[null,{"$f":"Vragenlijst!B670","v":50},{"$f":"Vragenlijst!C670","v":"Is er interesse in een benchmark/vergelijking met andere circulaire ambachtscentra?"},null,null,null,null,null,null,null,null,null,null,null,null,null,null,null,null,null,{"$f":"VLOOKUP(B80,'beantwoord - niet beantwoord'!$B$3:$C$56,2,FALSE)","v":0}]
[null,{"$f":"Vragenlijst!B674","v":51},{"$f":"Vragenlijst!C674","v":"Op welke eigenschappen zou een vergelijking tussen  en andere circulaire ambachtscentra gewenst zijn?"},null,null,null,null,null,null,null,null,null,null,null,null,null,null,null,null,null,{"$f":"VLOOKUP(B81,'beantwoord - niet beantwoord'!$B$3:$C$56,2,FALSE)","v":0}]
[]
[null,{"$f":"Vragenlijst!B685","v":"Aanvullende monitorgegevens"},null,null,null,null,null,null,null,null,null,null,null,null,null,null,null,null,null,"Ingevuld?"]
[null,{"$f":"Vragenlijst!B687","v":52},{"$f":"Vragenlijst!C687","v":"Verzamelt  aanvullende kwantitatieve monitoringsgegevens?"},null,null,null,null,null,null,null,null,null,null,null,null,null,null,null,null,null,{"$f":"VLOOKUP(B84,'beantwoord - niet beantwoord'!$B$3:$C$56,2,FALSE)","v":0}]
[null,{"$f":"Vragenlijst!B698","v":53},{"$f":"Vragenlijst!C698","v":"Is  bereid om deze gegevens met Rijkswaterstaat te delen?"},null,null,null,null,null,null,null,null,null,null,null,null,null,null,null,null,null,{"$f":"VLOOKUP(B85,'beantwoord - niet beantwoord'!$B$3:$C$56,2,FALSE)","v":0}]
[]
[null,{"$f":"Vragenlijst!B704","v":"Mededelingen en feedback"},null,null,null,null,null,null,null,null,null,null,null,null,null,null,null,null,null,"Ingevuld?"]
[null,{"$f":"Vragenlijst!B706","v":54},{"$f":"Vragenlijst!C706","v":"Hieronder is nog ruimte om afsluitende mededelingen of feedback te plaatsen:"},null,null,null,null,null,null,null,null,null,null,null,null,null,null,null,null,null,{"$f":"VLOOKUP(B88,'beantwoord - niet beantwoord'!$B$3:$C$56,2,FALSE)","v":0}]

{"sheet":"Vragenlijst","index":2,"n_rows":733,"n_cols":65,"rows_kept":733,"cut":false,"hidden":false,"merged":[[182,47,182,54],[183,47,183,54],[180,47,180,54],[181,47,181,54],[178,47,178,54],[179,47,179,54],[176,47,176,54],[177,47,177,54],[175,47,175,54],[472,26,472,30],[467,20,467,24],[468,20,468,24],[469,20,469,24],[471,32,471,35],[472,32,472,35],[172,47,172,54],[173,47,173,54],[174,47,174,54],[428,2,428,29],[315,36,315,38],[316,36,316,38],[317,36,317,38],[318,36,318,38],[319,36,319,38],[419,30,419,32],[419,33,419,35],[419,36,419,38],[420,30,420,32],[420,33,420,35],[420,36,420,38],[421,30,421,32],[476,37,476,41],[464,26,464,30],[465,26,465,30],[466,26,466,30],[429,2,429,29],[430,2,430,29],[553,8,553,27],[545,2,545,27],[546,2,546,27],[464,2,464,11],[465,2,465,11],[466,2,466,11],[472,2,472,11],[473,2,473,11],[474,2,474,11],[475,2,475,11],[112,28,112,41],[163,2,163,6],[514,2,514,27],[475,32,475,35],[476,26,476,30],[465,32,465,35],[466,32,466,35],[467,32,467,35],[469,32,469,35],[470,32,470,35],[470,20,470,24],[471,20,471,24],[472,20,472,24],[473,20,473,24],[474,20,474,24],[475,20,475,24],[476,20,476,24],[467,13,467,18],[468,13,468,18],[469,13,469,18],[470,13,470,18],[471,13,471,18],[472,13,472,18],[470,26,470,30],[471,26,471,30],[455,2,455,16],[456,2,456,16],[457,2,457,16],[458,2,458,16],[320,30,320,32],[321,30,321,32],[427,30,427,32],[474,32,474,35],[265,2,265,30],[320,2,320,29],[346,16,346,25],[347,16,347,25],[348,16,348,25],[346,2,346,11],[413,2,413,39],[376,2,376,11],[363,2,363,31],[415,2,415,3],[321,36,321,38],[322,36,322,38],[323,36,323,38],[324,36,324,38],[425,33,425,35],[425,36,425,38],[426,30,426,32],[314,36,314,38],[421,33,421,35],[321,33,321,35],[322,33,322,35],[323,33,323,35],[324,33,324,35],[336,2,336,29],[337,2,337,29],[348,2,348,11],[270,2,270,29],[278,2,278,29],[334,2,334,29],[335,2,335,29],[426,33,426,35],[612,8,612,30],[347,31,347,40],[345,31,345,35],[345,36,345,40],[364,2,364,31],[445,2,445,41],[498,2,498,41],[430,33,430,35],[430,36,430,38],[422,33,422,35],[422,36,422,38],[423,30,423,32],[423,33,423,35],[423,36,423,38],[426,2,426,29],[427,2,427,29],[375,2,375,11],[353,2,354,41],[367,2,368,41],[421,2,421,29],[611,2,611,30],[511,2,511,6],[511,7,511,10],[483,13,483,17],[484,13,484,17],[485,13,485,17],[486,13,486,17],[487,13,487,17],[488,13,488,17],[489,13,489,17],[476,32,476,35],[464,20,464,24],[300,1,301,1],[603,2,603,10],[601,11,601,12],[602,11,602,12],[603,11,603,12],[555,8,555,27],[556,2,556,7],[556,8,556,27],[559,2,560,39],[565,2,565,9],[564,10,564,12],[564,13,564,15],[568,2,568,9],[501,7,501,10],[587,2,587,21],[561,2,562,39],[544,2,544,27],[600,2,600,10],[543,2,543,27],[582,2,582,7],[469,26,469,30],[467,26,467,30],[468,26,468,30],[473,26,473,30],[474,26,474,30],[463,32,463,35],[464,32,464,35],[567,10,567,12],[318,2,318,29],[476,2,476,11],[475,13,475,18],[476,13,476,18],[612,2,612,7],[303,2,303,16],[304,2,304,16],[537,2,537,27],[577,2,577,24],[553,2,553,7],[566,2,566,9],[482,2,482,11],[482,19,482,23],[483,2,483,11],[483,19,483,23],[510,2,510,6],[510,7,510,10],[490,13,490,17],[491,13,491,17],[492,13,492,17],[493,13,493,17],[345,2,345,11],[345,16,345,25],[469,2,469,11],[470,2,470,11],[475,26,475,30],[463,13,463,18],[463,20,463,24],[463,26,463,30],[464,13,464,18],[465,13,465,18],[466,13,466,18],[305,2,305,16],[306,2,306,16],[566,10,566,12],[317,2,317,29],[220,2,220,30],[221,2,221,30],[222,8,222,30],[223,2,223,30],[269,2,269,29],[322,30,322,32],[323,30,323,32],[324,30,324,32],[324,2,324,29],[422,30,422,32],[500,2,500,6],[500,7,500,10],[501,2,501,6],[430,30,430,32],[315,2,315,29],[410,2,410,14],[411,2,411,14],[450,2,450,16],[451,2,451,16],[452,2,452,16],[453,2,453,16],[454,2,454,16],[237,13,237,16],[239,13,239,16],[240,13,240,16],[359,2,359,31],[422,2,422,29],[360,2,360,31],[316,2,316,29],[313,30,313,32],[314,30,314,32],[349,16,349,25],[694,2,695,38],[692,2,692,3],[681,2,681,9],[681,10,681,19],[679,2,679,9],[680,2,680,9],[634,11,634,21],[635,31,635,38],[636,31,636,38],[638,31,638,38],[649,2,649,10],[650,2,650,10],[637,31,637,38],[649,11,649,12],[650,11,650,12],[649,15,649,26],[650,15,650,26],[635,28,635,29],[636,28,636,29],[637,23,637,27],[634,23,634,27],[638,23,638,27],[639,2,639,9],[634,2,634,9],[635,2,635,9],[636,2,636,9],[637,2,637,9],[638,2,638,9],[637,28,637,29],[635,23,635,27],[636,23,636,27],[635,11,635,21],[112,25,112,26],[85,2,85,9],[85,10,85,12],[257,18,257,20],[258,18,258,20],[259,18,259,20],[255,21,255,23],[256,21,256,23],[547,2,547,27],[333,2,333,29],[610,2,610,30],[634,31,634,38],[243,13,243,16],[244,13,244,16],[261,2,261,6],[386,2,386,17],[382,2,382,17],[406,2,406,14],[407,2,407,14],[408,2,408,14],[409,2,409,14],[258,21,258,23],[259,21,259,23],[260,21,260,23],[261,18,261,20],[459,2,459,16],[261,21,261,23],[349,2,349,11],[350,2,350,11],[358,2,358,31],[167,2,167,13],[219,2,219,30],[370,2,370,29],[487,19,487,23],[320,36,320,38],[424,30,424,32],[424,33,424,35],[424,36,424,38],[425,30,425,32],[428,30,428,32],[428,33,428,35],[428,36,428,38],[315,30,315,32],[316,30,316,32],[317,30,317,32],[318,30,318,32],[319,30,319,32],[347,2,347,11],[424,2,424,29],[484,2,484,11],[423,2,423,29],[328,2,328,37],[384,2,384,17],[381,2,381,17],[464,37,464,41],[465,37,465,41],[466,37,466,41],[467,37,467,41],[468,37,468,41],[469,37,469,41],[470,37,470,41],[471,37,471,41],[472,37,472,41],[473,37,473,41],[85,34,85,36],[81,25,81,27],[81,28,81,30],[81,31,81,33],[80,10,80,12],[86,28,86,30],[86,34,86,36],[85,22,85,24],[85,25,85,27],[6,2,6,11],[7,2,7,11],[6,12,6,18],[37,2,37,20],[80,13,80,15],[80,19,80,21],[68,23,68,39],[80,2,80,9],[74,2,75,39],[72,2,72,39],[24,2,24,20],[25,2,25,20],[26,2,26,20],[16,2,16,20],[17,2,17,20],[18,2,18,20],[19,2,19,20],[23,2,23,20],[73,2,73,41],[7,12,7,18],[82,19,82,21],[82,22,82,24],[82,10,82,12],[82,13,82,15],[85,16,85,18],[82,16,82,18],[85,19,85,21],[85,13,85,15],[84,2,84,9],[84,10,84,12],[101,13,101,15],[84,19,84,21],[84,22,84,24],[84,25,84,27],[84,28,84,30],[84,31,84,33],[80,28,80,30],[80,31,80,33],[80,22,80,24],[80,25,80,27],[83,2,83,9],[83,10,83,12],[83,13,83,15],[83,16,83,18],[83,19,83,21],[83,22,83,24],[83,25,83,27],[83,28,83,30],[83,31,83,33],[80,16,80,18],[101,22,101,24],[101,25,101,27],[101,28,101,30],[101,31,101,33],[83,34,83,36],[85,28,85,30],[85,31,85,33],[101,16,101,18],[101,19,101,21],[12,21,12,39],[16,21,16,39],[17,21,17,39],[18,21,18,39],[19,21,19,39],[81,2,81,9],[81,10,81,12],[81,13,81,15],[81,16,81,18],[81,19,81,21],[81,22,81,24],[68,2,68,20],[69,2,69,20],[30,2,30,20],[31,2,31,20],[32,2,32,20],[33,2,33,20],[34,2,34,20],[35,2,35,20],[36,2,36,20],[80,37,80,39],[81,34,81,36],[81,37,81,39],[80,34,80,36],[65,2,65,20],[66,2,66,20],[87,34,87,36],[67,2,67,20],[89,34,89,36],[87,28,87,30],[87,31,87,33],[44,2,44,39],[45,2,45,39],[46,2,46,39],[47,2,47,39],[48,2,48,39],[83,37,83,39],[84,34,84,36],[84,37,84,39],[82,25,82,27],[82,28,82,30],[82,31,82,33],[84,13,84,15],[84,16,84,18],[85,37,85,39],[86,2,86,9],[86,10,86,12],[86,13,86,15],[86,16,86,18],[86,19,86,21],[86,22,86,24],[86,25,86,27],[63,2,63,41],[86,31,86,33],[86,37,86,39],[82,34,82,36],[82,37,82,39],[52,2,53,41],[82,2,82,9],[108,16,108,18],[87,37,87,39],[88,2,88,9],[88,10,88,12],[88,13,88,15],[88,16,88,18],[88,19,88,21],[88,22,88,24],[88,25,88,27],[88,28,88,30],[88,31,88,33],[88,34,88,36],[88,37,88,39],[87,2,87,9],[87,10,87,12],[87,13,87,15],[87,16,87,18],[87,19,87,21],[87,22,87,24],[87,25,87,27],[89,37,89,39],[90,2,90,9],[90,10,90,12],[90,13,90,15],[90,16,90,18],[90,19,90,21],[90,22,90,24],[90,25,90,27],[90,28,90,30],[90,31,90,33],[90,34,90,36],[90,37,90,39],[89,2,89,9],[89,10,89,12],[89,13,89,15],[89,16,89,18],[89,19,89,21],[89,22,89,24],[89,25,89,27],[89,28,89,30],[89,31,89,33],[91,37,91,39],[92,2,92,9],[92,10,92,12],[92,13,92,15],[92,16,92,18],[92,19,92,21],[92,22,92,24],[92,25,92,27],[92,28,92,30],[92,31,92,33],[92,34,92,36],[92,37,92,39],[91,2,91,9],[91,10,91,12],[91,13,91,15],[91,16,91,18],[91,19,91,21],[91,22,91,24],[91,25,91,27],[91,28,91,30],[91,31,91,33],[91,34,91,36],[93,37,93,39],[94,2,94,9],[94,10,94,12],[94,13,94,15],[94,16,94,18],[94,19,94,21],[94,22,94,24],[94,25,94,27],[94,28,94,30],[94,31,94,33],[94,34,94,36],[94,37,94,39],[93,2,93,9],[93,10,93,12],[93,13,93,15],[93,16,93,18],[93,19,93,21],[93,22,93,24],[93,25,93,27],[93,28,93,30],[93,31,93,33],[93,34,93,36],[95,37,95,39],[96,2,96,9],[96,10,96,12],[96,13,96,15],[96,16,96,18],[96,19,96,21],[96,22,96,24],[96,25,96,27],[96,28,96,30],[96,31,96,33],[96,34,96,36],[96,37,96,39],[95,2,95,9],[95,10,95,12],[95,13,95,15],[95,16,95,18],[95,19,95,21],[95,22,95,24],[95,25,95,27],[95,28,95,30],[95,31,95,33],[95,34,95,36],[97,37,97,39],[98,2,98,9],[98,10,98,12],[98,13,98,15],[98,16,98,18],[98,19,98,21],[98,22,98,24],[98,25,98,27],[98,28,98,30],[98,31,98,33],[98,34,98,36],[98,37,98,39],[97,2,97,9],[97,10,97,12],[97,13,97,15],[97,16,97,18],[97,19,97,21],[97,22,97,24],[97,25,97,27],[97,28,97,30],[97,31,97,33],[97,34,97,36],[99,37,99,39],[100,2,100,9],[100,10,100,12],[100,13,100,15],[100,16,100,18],[100,19,100,21],[100,22,100,24],[100,25,100,27],[100,28,100,30],[100,31,100,33],[100,34,100,36],[100,37,100,39],[99,2,99,9],[99,10,99,12],[99,13,99,15],[99,16,99,18],[99,19,99,21],[99,22,99,24],[99,25,99,27],[99,28,99,30],[99,31,99,33],[99,34,99,36],[108,19,108,21],[108,22,108,24],[108,25,108,27],[108,28,108,30],[108,31,108,33],[101,34,101,36],[101,37,101,39],[107,2,107,9],[107,10,107,12],[107,13,107,15],[107,16,107,18],[107,19,107,21],[107,22,107,24],[107,25,107,27],[107,28,107,30],[107,31,107,33],[107,34,107,36],[107,37,107,39],[104,2,104,9],[104,10,104,12],[104,13,104,15],[104,16,104,18],[104,19,104,21],[104,22,104,24],[104,25,104,27],[104,28,104,30],[104,31,104,33],[104,34,104,36],[104,37,104,39],[101,2,101,9],[101,10,101,12],[103,28,103,30],[103,31,103,33],[103,34,103,36],[103,37,103,39],[114,2,114,9],[110,34,110,36],[110,37,110,39],[110,2,110,9],[110,10,110,12],[110,13,110,15],[110,16,110,18],[110,19,110,21],[110,22,110,24],[110,25,110,27],[110,28,110,30],[110,31,110,33],[108,34,108,36],[108,37,108,39],[109,2,109,9],[109,10,109,12],[109,13,109,15],[109,16,109,18],[109,19,109,21],[109,22,109,24],[109,25,109,27],[109,28,109,30],[109,31,109,33],[109,34,109,36],[109,37,109,39],[108,2,108,9],[108,10,108,12],[108,13,108,15],[106,25,106,27],[106,28,106,30],[106,31,106,33],[106,34,106,36],[106,37,106,39],[105,2,105,9],[105,10,105,12],[105,13,105,15],[105,16,105,18],[105,19,105,21],[105,22,105,24],[105,25,105,27],[105,28,105,30],[105,31,105,33],[102,2,102,9],[102,10,102,12],[102,13,102,15],[102,16,102,18],[102,19,102,21],[102,22,102,24],[102,25,102,27],[102,28,102,30],[102,31,102,33],[102,34,102,36],[102,37,102,39],[103,2,103,9],[103,10,103,12],[103,13,103,15],[103,16,103,18],[103,19,103,21],[103,22,103,24],[103,25,103,27],[105,34,105,36],[125,16,125,18],[125,19,125,21],[125,22,125,24],[125,25,125,27],[125,28,125,30],[125,31,125,33],[125,34,125,36],[125,37,125,39],[116,10,116,12],[116,13,116,15],[116,16,116,18],[116,19,116,21],[116,22,116,24],[116,25,116,27],[116,28,116,30],[116,31,116,33],[116,34,116,36],[116,37,116,39],[121,2,121,39],[105,37,105,39],[106,2,106,9],[106,10,106,12],[106,13,106,15],[106,16,106,18],[106,19,106,21],[106,22,106,24],[126,34,126,36],[126,37,126,39],[127,2,127,9],[127,10,127,12],[127,13,127,15],[127,16,127,18],[127,19,127,21],[127,22,127,24],[127,25,127,27],[127,28,127,30],[127,31,127,33],[127,34,127,36],[127,37,127,39],[126,2,126,9],[126,10,126,12],[126,13,126,15],[126,16,126,18],[126,19,126,21],[126,22,126,24],[126,25,126,27],[126,28,126,30],[126,31,126,33],[125,2,125,9],[125,10,125,12],[125,13,125,15],[128,34,128,36],[128,37,128,39],[129,2,129,9],[129,10,129,12],[129,13,129,15],[129,16,129,18],[129,19,129,21],[129,22,129,24],[129,25,129,27],[129,28,129,30],[129,31,129,33],[129,34,129,36],[129,37,129,39],[128,2,128,9],[128,10,128,12],[128,13,128,15],[128,16,128,18],[128,19,128,21],[128,22,128,24],[128,25,128,27],[128,28,128,30],[128,31,128,33],[130,34,130,36],[130,37,130,39],[131,2,131,9],[131,10,131,12],[131,13,131,15],[131,16,131,18],[131,19,131,21],[131,22,131,24],[131,25,131,27],[131,28,131,30],[131,31,131,33],[131,34,131,36],[131,37,131,39],[130,2,130,9],[130,10,130,12],[130,13,130,15],[130,16,130,18],[130,19,130,21],[130,22,130,24],[130,25,130,27],[130,28,130,30],[130,31,130,33],[132,34,132,36],[132,37,132,39],[133,2,133,9],[133,10,133,12],[133,13,133,15],[133,16,133,18],[133,19,133,21],[133,22,133,24],[133,25,133,27],[133,28,133,30],[133,31,133,33],[133,34,133,36],[133,37,133,39],[132,2,132,9],[132,10,132,12],[132,13,132,15],[132,16,132,18],[132,19,132,21],[132,22,132,24],[132,25,132,27],[132,28,132,30],[132,31,132,33],[134,34,134,36],[134,37,134,39],[135,2,135,9],[135,10,135,12],[135,13,135,15],[135,16,135,18],[135,19,135,21],[135,22,135,24],[135,25,135,27],[135,28,135,30],[135,31,135,33],[135,34,135,36],[135,37,135,39],[134,2,134,9],[134,10,134,12],[134,13,134,15],[134,16,134,18],[134,19,134,21],[134,22,134,24],[134,25,134,27],[134,28,134,30],[134,31,134,33],[136,34,136,36],[136,37,136,39],[137,2,137,9],[137,10,137,12],[137,13,137,15],[137,16,137,18],[137,19,137,21],[137,22,137,24],[137,25,137,27],[137,28,137,30],[137,31,137,33],[137,34,137,36],[137,37,137,39],[136,2,136,9],[136,10,136,12],[136,13,136,15],[136,16,136,18],[136,19,136,21],[136,22,136,24],[136,25,136,27],[136,28,136,30],[136,31,136,33],[138,34,138,36],[138,37,138,39],[139,2,139,9],[139,10,139,12],[139,13,139,15],[139,16,139,18],[139,19,139,21],[139,22,139,24],[139,25,139,27],[139,28,139,30],[139,31,139,33],[139,34,139,36],[139,37,139,39],[138,2,138,9],[138,10,138,12],[138,13,138,15],[138,16,138,18],[138,19,138,21],[138,22,138,24],[138,25,138,27],[138,28,138,30],[138,31,138,33],[140,34,140,36],[140,37,140,39],[141,2,141,9],[141,10,141,12],[141,13,141,15],[141,16,141,18],[141,19,141,21],[141,22,141,24],[141,25,141,27],[141,28,141,30],[141,31,141,33],[141,34,141,36],[141,37,141,39],[140,2,140,9],[140,10,140,12],[140,13,140,15],[140,16,140,18],[140,19,140,21],[140,22,140,24],[140,25,140,27],[140,28,140,30],[140,31,140,33],[142,34,142,36],[142,37,142,39],[143,2,143,9],[143,10,143,12],[143,13,143,15],[143,16,143,18],[143,19,143,21],[143,22,143,24],[143,25,143,27],[143,28,143,30],[143,31,143,33],[143,34,143,36],[143,37,143,39],[142,2,142,9],[142,10,142,12],[142,13,142,15],[142,16,142,18],[142,19,142,21],[142,22,142,24],[142,25,142,27],[142,28,142,30],[142,31,142,33],[144,34,144,36],[144,37,144,39],[145,2,145,9],[145,10,145,12],[145,13,145,15],[145,16,145,18],[145,19,145,21],[145,22,145,24],[145,25,145,27],[145,28,145,30],[145,31,145,33],[145,34,145,36],[145,37,145,39],[144,2,144,9],[144,10,144,12],[144,13,144,15],[144,16,144,18],[144,19,144,21],[144,22,144,24],[144,25,144,27],[144,28,144,30],[144,31,144,33],[146,34,146,36],[146,37,146,39],[147,2,147,9],[147,10,147,12],[147,13,147,15],[147,16,147,18],[147,19,147,21],[147,22,147,24],[147,25,147,27],[147,28,147,30],[147,31,147,33],[147,34,147,36],[147,37,147,39],[146,2,146,9],[146,10,146,12],[146,13,146,15],[146,16,146,18],[146,19,146,21],[146,22,146,24],[146,25,146,27],[146,28,146,30],[146,31,146,33],[148,34,148,36],[148,37,148,39],[149,2,149,9],[149,10,149,12],[149,13,149,15],[149,16,149,18],[149,19,149,21],[149,22,149,24],[149,25,149,27],[149,28,149,30],[149,31,149,33],[149,34,149,36],[149,37,149,39],[148,2,148,9],[148,10,148,12],[148,13,148,15],[148,16,148,18],[148,19,148,21],[148,22,148,24],[148,25,148,27]],"merged_total":1538,"flags":["merged_cut"]}
[]
[null,{"$f":" CONCATENATE(\"Monitor Circulaire Ambachtscentra \",RIGHT(M7,4))","v":"Monitor Circulaire Ambachtscentra 2025"}]
[]
[]
[null,"Onderzoeksperiode"]
[null,null,null,null,null,null,null,null,null,null,null,null,null,null,null,null,null,null,null,null,null,null,null,null,null,null,null,null,null,null,null,null,null,null,null,null,null,null,null,null,null,null,null,null,"1=ingevuld"]
[null,null,"Monitoringsperiode",null,null,null,null,null,null,null,null,null,"1.1.2025 - 31.12.2025",null,null,null,null,null,null,null,null,null,null,null,null,null,null,null,null,null,null,null,null,null,null,null,null,null,null,null,null,null,null,null,"0=niet (goed) ingevuld"]
[null,null,"Datum ingevuld op",null,null,null,null,null,null,null,null,null,null,null,null,null,null,null,null,null,"Gebruik de volgende notatie: dd-mm-jjjj"]
[]
[]
[null,"Organisatiegegevens "]
[]
[null,1,"Wat is de naam van het circulaire ambachtscentrum? ",null,null,null,null,null,null,null,null,null,null,null,null,null,null,null,null,null,null,null,null,null,null,null,null,null,null,null,null,null,null,null,null,null,null,null,null,null,null,null,null,null,{"$f":"IF(V13<>\"\",1,0)","v":0}]
[]
[null,{"$f":"B13+1","v":2},"Wie is de contactpersoon voor het invullen van deze vragenlijst?",null,null,null,null,null,null,null,null,null,null,null,null,null,null,null,null,null,null,null,null,null,null,null,null,null,null,null,null,null,null,null,null,null,null,null,null,null,null,null,null,null,{"$f":"IF(SUM(AS17:AS20)=4,1,0)","v":0}]
[]
[null,null,"Voor- en achternaam",null,null,null,null,null,null,null,null,null,null,null,null,null,null,null,null,null,null,null,null,null,null,null,null,null,null,null,null,null,null,null,null,null,null,null,null,null,null,null,null,null,{"$f":"IF(V17<>\"\",1,0)","v":0}]
[null,null,"E-mailadres",null,null,null,null,null,null,null,null,null,null,null,null,null,null,null,null,null,null,null,null,null,null,null,null,null,null,null,null,null,null,null,null,null,null,null,null,null,null,null,null,null,{"$f":"IF(V18<>\"\",1,0)","v":0}]
[null,null,{"$f":"CONCATENATE(\"Functie binnen de organisatie van \",V13)","v":"Functie binnen de organisatie van "},null,null,null,null,null,null,null,null,null,null,null,null,null,null,null,null,null,null,null,null,null,null,null,null,null,null,null,null,null,null,null,null,null,null,null,null,null,null,null,null,null,0]
[null,null,"Werkzaam bij",null,null,null,null,null,null,null,null,null,null,null,null,null,null,null,null,null,null,null,null,null,null,null,null,null,null,null,null,null,null,null,null,null,null,null,null,null,null,null,null,null,0]
[]
[null,{"$f":"B15+1","v":3},{"$f":"CONCATENATE(\"In welk ontwikkelstadium bevindt \",V13,\" zich op \",RIGHT(M7,10),\"?\")","v":"In welk ontwikkelstadium bevindt  zich op 31.12.2025?"},null,null,null,null,null,null,null,null,null,null,null,null,null,null,null,null,null,null,null,null,null,null,null,null,null,null,null,null,null,null,null,null,null,null,null,null,null,null,null,null,null,{"$f":"IF(data!D12>0,1,0)","v":0}]
[]
[null,null,"Richten: onderzoeken mogelijkheden voor start"]
[null,null,"Inrichten: het ambachtscentrum is in ontwikkeling"]
[null,null,"Verrichten: het ambachtscentrum wordt in de praktijk getest"]
[null,null,"Gevorderd: het ambachtscentrum draait"]
[]
[null,{"$f":"B22+1","v":4},{"$f":"CONCATENATE(\"Met welke gemeenten werkt \",V13,\" samen?\")","v":"Met welke gemeenten werkt  samen?"},null,null,null,null,null,null,null,null,null,null,null,null,null,null,null,null,null,null,null,null,null,null,null,null,null,null,null,null,null,null,null,null,null,null,null,null,null,null,null,null,null,{"$f":"IF(C31=\"\",0,1)","v":0}]
[]
[null,1]
[null,{"$f":"B31+1","v":2}]
[null,{"$f":"B32+1","v":3}]
[null,4]
[null,5]
[null,6]
[null,7]
[null,8]
[]
[]
[null,"Doelstellingen en ambities"]
[]
[null,{"$f":"B29+1","v":5},{"$f":"CONCATENATE(\"Wat zijn de belangrijkste doelstellingen van \",V13,\"? \")","v":"Wat zijn de belangrijkste doelstellingen van ? "},null,null,null,null,null,null,null,null,null,null,null,null,null,null,null,null,null,null,null,null,null,null,null,null,null,null,null,null,null,null,null,null,null,null,null,null,null,null,null,null,null,{"$f":"IF(OR(C45<>\"\",AU51=TRUE),1,0)","v":0}]
[]
[null,1]
[null,{"$f":"B45+1","v":2}]
[null,{"$f":"B46+1","v":3}]
[null,{"$f":"B47+1","v":4}]
[null,{"$f":"B48+1","v":5}]
[]
[null,null,null,"geen"]
[]
[null,{"$f":"B43+1","v":6},"Wat is volgens jou en de betrokken partners de meerwaarde van samenwerken binnen een circulair ambachtscentrum, vergeleken met werken als losse organisaties?",null,null,null,null,null,null,null,null,null,null,null,null,null,null,null,null,null,null,null,null,null,null,null,null,null,null,null,null,null,null,null,null,null,null,null,null,null,null,null,null,null,{"$f":"IF(C56=\"\",0,1)","v":0}]
[]
[]
[]
[]
[]
[]
[]
[null,"Structuur en aangesloten organisaties"]
[]
[null,{"$f":"B53+1","v":7},{"$f":"CONCATENATE(\"Wat is de structuur van \",V13,\"?\")","v":"Wat is de structuur van ?"},null,null,null,null,null,null,null,null,null,null,null,null,null,null,null,null,null,null,null,null,null,null,null,null,null,null,null,null,null,null,null,null,null,null,null,null,null,null,null,null,null,{"$f":"IF(data!T12>0,1,0)","v":0}]
[null,null,"Zet een vinkje bij de optie die het beste past. Een bouwsteen kan ook gezien worden als functie. In vraag 8 worden alle bouwstenen benoemd die bij een circulair ambachtscentrum aanwezig kunnen zijn."]
[]
[null,null,"Alle bouwstenen zijn op eén locatie"]
[null,null,"De bouwstenen zijn verdeeld over meerdere locaties (netwerk)"]
[null,null,"Nog niet bekend"]
[null,null,"Anders, namelijk "]
[null,null,"Weet niet"]
[]
[]
[null,{"$f":"B63+1","v":8},{"$f":"CONCATENATE(\"Welke partners van \",V13,\" zijn aangesloten op \",RIGHT(M7,10),\"?\")","v":"Welke partners van  zijn aangesloten op 31.12.2025?"},null,null,null,null,null,null,null,null,null,null,null,null,null,null,null,null,null,null,null,null,null,null,null,null,null,null,null,null,null,null,null,null,null,null,null,null,null,null,null,null,null,{"$f":"IF(AND(C82=\"\",data!F17<1),0,1)","v":0}]
[null,null,"Geef aan bij welke primaire bouwsteen zij horen.\nEen partner van een circulair ambachtscentrum voert een ambacht uit en/of faciliteert levensduurverlinging van materialen of producten. Bij kringlooporganisaties en milieustraten dienen alle vestigingen aangegeven te worden."]
[null,null,{"$f":"CONCATENATE(\"Geef hieronder (links) de naam van de organisatie aan en de primaire bouwsteen die het vervult. Een mogelijke secundaire bouwsteen van een partner kan in vraag \",B120,\" aangegeven worden.\")","v":"Geef hieronder (links) de naam van de organisatie aan en de primaire bouwsteen die het vervult. Een mogelijke secundaire bouwsteen van een partner kan in vraag 9 aangegeven worden."}]
[]
[null,null,"Let op: een keuzerondje kan niet gedeselecteerd worden, gebruik dan de optie \"n.v.t.\"."]
[]
[null,null,null,null,null,null,null,null,null,null,"Primaire bouwstenen"]
[]
[null,null,"Naam partner",null,null,null,null,null,null,null,"Milieustraat ",null,null,"Kringloopwinkel",null,null,"Repair Café/\nReparatie-werkplaats",null,null,"Sociale partners",null,null,"Onderwijs-instelling",null,null,"Werkplaats en/of makers-plaats",null,null,"Initiatieven voor de deel-economie",null,null,"Ondernemers die hergebruiken of repareren",null,null,"Demontage",null,null,"Alternatief element",null,null,null,"n.v.t."]
[null,1]
[null,{"$f":"B82+1","v":2}]
[null,{"$f":"B83+1","v":3}]
[null,{"$f":"B84+1","v":4}]
[null,5]
[null,6]
[null,7]
[null,8]
[null,9]
[null,10]
[null,11]
[null,12]
[null,13]
[null,14]
[null,15]
[null,16]
[null,17]
[null,18]
[null,19]
[null,20]
[null,21]
[null,22]
[null,23]
[null,24]
[null,25]
[null,26]
[null,27]
[null,28]
[null,29]
[null,30]
[]
[null,null,{"$f":"CONCATENATE(\"Heeft \",V13,\" meer dan 30 partners?\")","v":"Heeft  meer dan 30 partners?"},null,null,null,null,null,null,null,null,null,null,null,null,null,null,null,null,null,null,null,null,null,null,null,null,null,{"$f":"IF(Z113=\"ja\",\"Gebruik de invulmatrix in tabblad 'Partners'\",\"\")","v":""}]
[]
[null,null,{"$f":"data!W12","v":0},null,null,null,null,null,null,null,"Totaal aantal partners (inclusief tabblad \"Partners\")"]
[]
[null,null,"Aantal partners per bouwsteen",null,null,null,null,null,null,null,{"$f":"Partners!K116","v":0},null,null,{"$f":"Partners!N116","v":0},null,null,{"$f":"Partners!Q116","v":0},null,null,{"$f":"Partners!T116","v":0},null,null,{"$f":"Partners!W116","v":0},null,null,{"$f":"Partners!Z116","v":0},null,null,{"$f":"Partners!AC116","v":0},null,null,{"$f":"Partners!AF116","v":0},null,null,{"$f":"Partners!AI116","v":0},null,null,{"$f":"Partners!AL116","v":0}]
[]
[]
[null,{"$f":"B73+1","v":9},"Zijn er partners die ook bij een andere bouwsteen passen? Zo ja, welke?",null,null,null,null,null,null,null,null,null,null,null,null,null,null,null,null,null,null,null,null,null,null,null,null,null,null,null,null,null,null,null,null,null,null,null,null,null,null,null,null,null,{"$f":"IF(AND(C127=\"\",data!G17<1),0,1)","v":0}]
[null,null,"Geef aan bij welke secundaire bouwsteen zij horen."]
[null,null,"Bijvoorbeeld een sociaal-maatschappelijke instelling die vooral reparatie-activiteiten uitvoert binnen het circulaire ambachtscentrum."]
[]
[null,null,null,null,null,null,null,null,null,null,"Secundaire bouwstenen"]
[]
[null,null,"Naam partner",null,null,null,null,null,null,null,"Milieustraat ",null,null,"Kringloop-winkel",null,null,"Repair Café/\nReparatie-werkplaats",null,null,"Sociale partners",null,null,"Onderwijs-instelling",null,null,"Werkplaats en/of makers-plaats",null,null,"Initiatieven voor de deel-economie",null,null,"Ondernemers die hergebruiken of repareren",null,null,"Demontage",null,null,"Alternatief element",null,null,null,"n.v.t."]
[null,1,{"$f":"IF(C82=\"\",\"\",C82)","v":""}]
[null,{"$f":"B127+1","v":2},""]
[null,{"$f":"B128+1","v":3},""]
[null,4,""]
[null,5,""]
[null,6,""]
[null,7,""]
[null,8,""]
[null,9,""]
[null,10,""]
[null,11,""]
[null,12,""]
[null,13,""]
[null,14,""]
[null,15,""]
[null,16,""]
[null,17,""]
[null,18,""]
[null,19,""]
[null,20,""]
[null,21,""]
[null,22,""]
[null,23,""]
[null,24,""]
[null,25,""]
[null,26,""]
[null,27,""]
[null,28,""]
[null,29,""]
[null,30,""]
[]
[null,null,{"$f":"C115","v":0},null,null,null,null,null,null,null,"Totaal aantal partners (inclusief tabblad \"partners\")"]
[]
[null,null,"Aantal partners per bouwsteen",null,null,null,null,null,null,null,{"$f":"Partners!AS116","v":0},null,null,{"$f":"Partners!AV116","v":0},null,null,{"$f":"Partners!AY116","v":0},null,null,{"$f":"Partners!BB116","v":0},null,null,{"$f":"Partners!BE116","v":0},null,null,{"$f":"Partners!BH116","v":0},null,null,{"$f":"Partners!BK116","v":0},null,null,{"$f":"Partners!BN116","v":0},null,null,{"$f":"Partners!BQ116","v":0},null,null,{"$f":"Partners!BT116","v":0}]
[]
[null,{"$f":"B120+1","v":10},{"$f":"CONCATENATE(\"Werkt \",V13,\"  samen met regionale ontwikkel- en werkcentra?\")","v":"Werkt   samen met regionale ontwikkel- en werkcentra?"},null,null,null,null,null,null,null,null,null,null,null,null,null,null,null,null,null,null,null,null,null,null,null,null,null,null,null,null,null,null,null,null,null,null,null,null,null,null,null,null,null,{"$f":"IF(C164=\"\",0,1)","v":0}]
[]
[]
[]
[]
[null,"Materiaalstromen"]
[]
[null,{"$f":"B162+1","v":11},{"$f":"CONCATENATE(\"Welke bouwstenen van \",V13,\" dragen bij aan levensduurverlenging van de volgende materialen/productgroepen?\")","v":"Welke bouwstenen van  dragen bij aan levensduurverlenging van de volgende materialen/productgroepen?"},null,null,null,null,null,null,null,null,null,null,null,null,null,null,null,null,null,null,null,null,null,null,null,null,null,null,null,null,null,null,null,null,null,null,null,null,null,null,null,null,null,{"$f":"IF(COUNTIFS(data!E126:U136,TRUE)>0,1,0)","v":0}]
[null,null,"Onder levensduurverlenging wordt ook het inzamelen voor hergebruik of reparatie bedoeld, bijvoorbeeld door een milieustraat. Recycling hoort niet bij levensduurverlening."]
[null,null,"Zet kruisen in de matrix en vul zo nodig de productgroepen aan."]
[]
[null,null,"Producten en materialen",null,null,null,null,null,null,null,"Milieustraat ",null,null,"Kringloopwinkel",null,null,"Repair Café/\nReparatie-werkplaats",null,null,"Sociaal-maatschap-pelijke instelling",null,null,"Onderwijs-instelling",null,null,"Werkplaats en/of makers-plaats",null,null,"Initiatieven voor de deel-economie",null,null,"Ondernemers die hergebruiken of repareren",null,null,"Demontage",null,null,"Alternatief element",null,null,null,null,null,null,null,null,null,"Producten en materialen",null,null,null,null,null,null,null,"Milieustraat ","Kringloopwinkel","Repair Café/\nReparatie-werkplaats","Sociaal-maatschap-pelijke instelling","Onderwijs-instelling","Werkplaats en/of makers-plaats","Initiatieven voor de deel-economie","Ondernemers die hergebruiken of repareren","Demontage","Alternatief element"]
[null,1,"Elektrische apparaten",null,null,null,null,null,null,null,null,null,null,null,null,null,null,null,null,null,null,null,null,null,null,null,null,null,null,null,null,null,null,null,null,null,null,null,null,null,null,null,null,null,null,null,null,"Elektrische apparaten"]
[null,{"$f":"B174+1","v":2},"Fietsen",null,null,null,null,null,null,null,null,null,null,null,null,null,null,null,null,null,null,null,null,null,null,null,null,null,null,null,null,null,null,null,null,null,null,null,null,null,null,null,null,null,null,null,null,"Fietsen"]
[null,{"$f":"B175+1","v":3},"Meubilair en onderdelen",null,null,null,null,null,null,null,null,null,null,null,null,null,null,null,null,null,null,null,null,null,null,null,null,null,null,null,null,null,null,null,null,null,null,null,null,null,null,null,null,null,null,null,null,"Meubilair en onderdelen"]
[null,4,"Textiel",null,null,null,null,null,null,null,null,null,null,null,null,null,null,null,null,null,null,null,null,null,null,null,null,null,null,null,null,null,null,null,null,null,null,null,null,null,null,null,null,null,null,null,null,"Textiel"]
[null,5,"Metaal/staal",null,null,null,null,null,null,null,null,null,null,null,null,null,null,null,null,null,null,null,null,null,null,null,null,null,null,null,null,null,null,null,null,null,null,null,null,null,null,null,null,null,null,null,null,"Metaal/staal"]
[null,6,"Hout (balken, plaatmateriaal)",null,null,null,null,null,null,null,null,null,null,null,null,null,null,null,null,null,null,null,null,null,null,null,null,null,null,null,null,null,null,null,null,null,null,null,null,null,null,null,null,null,null,null,null,"Hout (balken, plaatmateriaal)"]
[null,7,"Overige bouwmaterialen (anders dan hout en metaal)",null,null,null,null,null,null,null,null,null,null,null,null,null,null,null,null,null,null,null,null,null,null,null,null,null,null,null,null,null,null,null,null,null,null,null,null,null,null,null,null,null,null,null,null,"Overige bouwmaterialen (anders dan hout en metaal)"]
[null,8,null,null,null,null,null,null,null,null,null,null,null,null,null,null,null,null,null,null,null,null,null,null,null,null,null,null,null,null,null,null,null,null,null,null,null,null,null,null,null,null,null,null,null,null,null,{"$f":"C181","v":0}]
[null,9,null,null,null,null,null,null,null,null,null,null,null,null,null,null,null,null,null,null,null,null,null,null,null,null,null,null,null,null,null,null,null,null,null,null,null,null,null,null,null,null,null,null,null,null,null,{"$f":"C182","v":0}]
[null,10,null,null,null,null,null,null,null,null,null,null,null,null,null,null,null,null,null,null,null,null,null,null,null,null,null,null,null,null,null,null,null,null,null,null,null,null,null,null,null,null,null,null,null,null,null,0]
[null,11,null,null,null,null,null,null,null,null,null,null,null,null,null,null,null,null,null,null,null,null,null,null,null,null,null,null,null,null,null,null,null,null,null,null,null,null,null,null,null,null,null,null,null,null,null,0]
[]
[null,{"$f":"B169+1","v":12},"Welke handelingen worden per materiaal/productgroep uitgevoerd?",null,null,null,null,null,null,null,null,null,null,null,null,null,null,null,null,null,null,null,null,null,null,null,null,null,null,null,null,null,null,null,null,null,null,null,null,null,null,null,null,null,{"$f":"IF(COUNTIF(data!O126:U136,TRUE)>0,1,0)","v":0}]
[]
[null,null,"Producten en materialen",null,null,null,null,null,null,null,"Direct hergebruik door bijvoorbeeld verkoop",null,null,"Hergebruik na repareren of refurbish",null,null,"Repurpose/ upcycling",null,null,"Gebruik als lesmateriaal",null,null,"Demontage voor onderdelen-hergebruik",null,null,"Demontage voor recycling",null,null,"Anders"]
[null,1,{"$f":"C174","v":"Elektrische apparaten"}]
[null,{"$f":"B189+1","v":2},"Fietsen"]
[null,{"$f":"B190+1","v":3},"Meubilair en onderdelen"]
[null,4,"Textiel"]
[null,5,"Metaal/staal"]
[null,6,"Hout (balken, plaatmateriaal)"]
[null,7,"Overige bouwmaterialen (anders dan hout en metaal)"]
[null,8]
[null,9]
[null,10]
[null,11]
[]
[]
[null,"Milieustraat"]
[]
[null,{"$f":"B186+1","v":13},{"$f":"CONCATENATE(\"Hoeveel milieustraten heeft de deelnemende gemeente/hebben de deelnemende gemeenten in totaal?\")","v":"Hoeveel milieustraten heeft de deelnemende gemeente/hebben de deelnemende gemeenten in totaal?"},null,null,null,null,null,null,null,null,null,null,null,null,null,null,null,null,null,null,null,null,null,null,null,null,null,null,null,null,null,null,null,null,null,null,null,null,null,null,null,null,null,{"$f":"IF(AI204<>\"\",1,0)","v":0}]
[]
[null,{"$f":"B204+1","v":14},{"$f":"CONCATENATE(\"Hoeveel van deze milieustraten zijn aangesloten bij \",V13,\"?\")","v":"Hoeveel van deze milieustraten zijn aangesloten bij ?"},null,null,null,null,null,null,null,null,null,null,null,null,null,null,null,null,null,null,null,null,null,null,null,null,null,null,null,null,null,null,null,null,null,null,null,null,null,null,null,null,null,{"$f":"IF(AI206<>\"\",1,0)","v":0}]
[]
[null,null,{"$f":"IFERROR(CONCATENATE(\"Dat betekent dat \",ROUND(AI206/AI204*100,0),\"% van de gemeentelijke milieustraten aangesloten zijn bij \",V13,\".\"),\"\")","v":""}]
[]
[null,null,{"$f":"CONCATENATE(\"Zit het ingewikkelder in elkaar bij \",V13,\"? Geef dan hieronder een toelichting.\")","v":"Zit het ingewikkelder in elkaar bij ? Geef dan hieronder een toelichting."}]
[]
[]
[]
[]
[null,{"$f":"B206+1","v":15},"Welke voorzieningen zijn op de milieustraat aanwezig om hergebruik te stimuleren?",null,null,null,null,null,null,null,null,null,null,null,null,null,null,null,null,null,null,null,null,null,null,null,null,null,null,null,null,null,null,null,null,null,null,null,null,null,null,null,null,null,{"$f":"IF(COUNTIF(data!G141:N141,TRUE)>0,1,0)","v":0}]
[]
[null,null,"Voor of op de milieustraat komen burgers eerst langs de kringloopwinkel of een innamepunt voor herbruikbare goederen. "]
[null,null,"Personeel helpt bij het beoordelen van herbruikbare spullen."]
[null,null,"Er staat een container/er is een plek om herbruikbare spullen in te leveren (voor kringloop)."]
[null,null,"Er staat een container/er is een plek om spullen in te leveren voor afname door circulaire ondernemers."]
[null,null,"Er staat een container/er is een plek om repareerbare spullen in te leveren."]
[null,null,"Personeel sorteert spullen die hergebruikt kunnen worden."]
[null,null,"Anders, namelijk:"]
[null,null,"geen"]
[]
[]
[null,"Kringloop- en weggeefwinkels"]
[]
[null,{"$f":"B215+1","v":16},{"$f":"CONCATENATE(\"Welke kringlooporganisaties binnen \",V13,\" zijn lid van Branchevereniging Kringloop Nederland (BKN)?\")","v":"Welke kringlooporganisaties binnen  zijn lid van Branchevereniging Kringloop Nederland (BKN)?"},null,null,null,null,null,null,null,null,null,null,null,null,null,null,null,null,null,null,null,null,null,null,null,null,null,null,null,null,null,null,null,null,null,null,null,null,null,null,null,null,null,{"$f":"IF(AS235<>AT235,0,1)","v":{"$error":"#VALUE!"}}]
[]
[null,null,"Rijkswaterstaat heeft direct contact met BKN en kan via haar gegevens ontvangen. Voordat RWS de gegevens ontvangt zal RWS de contactpersoon van de kringloopwinkel nog eens schriftelijk om Akkoord vragen.\nRijkswaterstaat zal deze gegevens samenvatten en onderzoeken hoe zij waarde toevoegen aan de monitor Circulaire Ambachstcentra."]
[]
[]
[]
[null,null,null,null,null,null,null,null,null,null,null,null,null,"Lid van BKN",null,null,null,null,"Geen lid van BKN",null,null,null,null,null,null,null,null,null,null,null,null,null,null,null,null,null,null,null,null,null,null,null,null,null,{"$f":"SUM(AS236:AS245)","v":{"$error":"#VALUE!"}},{"$f":"BB246","v":0},null,null,null,null,"naam","type","type_def"]
[null,null,{"$f":"IF(AND(hulp!B4<>\"\",hulp!B4<>0),hulp!B4,\"\")","v":{"$error":"#VALUE!"}},null,null,null,null,null,null,null,null,null,null,null,null,null,null,null,null,null,null,null,null,null,null,null,null,null,null,null,null,null,null,null,null,null,null,null,null,null,null,null,null,null,{"$f":"IF(AND(C236<>\"\",AZ236<>0),1,0)","v":{"$error":"#VALUE!"}},null,null,null,null,null,{"$f":"C236","v":{"$error":"#VALUE!"}},null,{"$f":"IF(AY236=\"\",\"\",IF(AZ236=1,TRUE,IF(AZ236=2,FALSE,\"geen data\")))","v":{"$error":"#VALUE!"}},{"$f":"IF(AY236=\"\",\"\",AZ236)","v":{"$error":"#VALUE!"}}]
[null,null,{"$f":"IF(AND(hulp!B5<>\"\",hulp!B5<>0),hulp!B5,\"\")","v":""},null,null,null,null,null,null,null,null,null,null,null,null,null,null,null,null,null,null,null,null,null,null,null,null,null,null,null,null,null,null,null,null,null,null,null,null,null,null,null,null,null,{"$f":"IF(AND(C237<>\"\",AZ237<>0),1,0)","v":0},null,null,null,null,null,{"$f":"C237","v":""},null,{"$f":"IF(AY237=\"\",\"\",IF(AZ237=1,TRUE,IF(AZ237=2,FALSE,\"geen data\")))","v":""},{"$f":"IF(AY237=\"\",\"\",AZ237)","v":""}]
[null,null,{"$f":"IF(AND(hulp!B6<>\"\",hulp!B6<>0),hulp!B6,\"\")","v":""},null,null,null,null,null,null,null,null,null,null,null,null,null,null,null,null,null,null,null,null,null,null,null,null,null,null,null,null,null,null,null,null,null,null,null,null,null,null,null,null,null,0,null,null,null,null,null,{"$f":"C238","v":""},null,"",""]
[null,null,{"$f":"IF(AND(hulp!B7<>\"\",hulp!B7<>0),hulp!B7,\"\")","v":""},null,null,null,null,null,null,null,null,null,null,null,null,null,null,null,null,null,null,null,null,null,null,null,null,null,null,null,null,null,null,null,null,null,null,null,null,null,null,null,null,null,0,null,null,null,null,null,"",null,"",""]
[null,null,{"$f":"IF(AND(hulp!B8<>\"\",hulp!B8<>0),hulp!B8,\"\")","v":""},null,null,null,null,null,null,null,null,null,null,null,null,null,null,null,null,null,null,null,null,null,null,null,null,null,null,null,null,null,null,null,null,null,null,null,null,null,null,null,null,null,0,null,null,null,null,null,"",null,"",""]
[null,null,{"$f":"IF(AND(hulp!B9<>\"\",hulp!B9<>0),hulp!B9,\"\")","v":""},null,null,null,null,null,null,null,null,null,null,null,null,null,null,null,null,null,null,null,null,null,null,null,null,null,null,null,null,null,null,null,null,null,null,null,null,null,null,null,null,null,0,null,null,null,null,null,"",null,"",""]
[null,null,{"$f":"IF(AND(hulp!B10<>\"\",hulp!B10<>0),hulp!B10,\"\")","v":""},null,null,null,null,null,null,null,null,null,null,null,null,null,null,null,null,null,null,null,null,null,null,null,null,null,null,null,null,null,null,null,null,null,null,null,null,null,null,null,null,null,0,null,null,null,null,null,"",null,"",""]
[null,null,{"$f":"IF(AND(hulp!B11<>\"\",hulp!B11<>0),hulp!B11,\"\")","v":""},null,null,null,null,null,null,null,null,null,null,null,null,null,null,null,null,null,null,null,null,null,null,null,null,null,null,null,null,null,null,null,null,null,null,null,null,null,null,null,null,null,0,null,null,null,null,null,"",null,"",""]
[null,null,{"$f":"IF(AND(hulp!B12<>\"\",hulp!B12<>0),hulp!B12,\"\")","v":""},null,null,null,null,null,null,null,null,null,null,null,null,null,null,null,null,null,null,null,null,null,null,null,null,null,null,null,null,null,null,null,null,null,null,null,null,null,null,null,null,null,0,null,null,null,null,null,"",null,"",""]
[null,null,{"$f":"IF(AND(hulp!B13<>\"\",hulp!B13<>0),hulp!B13,\"\")","v":""},null,null,null,null,null,null,null,null,null,null,null,null,null,null,null,null,null,null,null,null,null,null,null,null,null,null,null,null,null,null,null,null,null,null,null,null,null,null,null,null,null,0,null,null,null,null,null,"",null,"",""]
[null,null,null,null,null,null,null,null,null,null,null,null,null,null,null,null,null,null,null,null,null,null,null,null,null,null,null,null,null,null,null,null,null,null,null,null,null,null,null,null,null,null,null,null,null,null,null,null,null,null,null,null,null,{"$f":"COUNT(BB236:BB245)","v":0}]
[]
[null,"Repareren"]
[]
[null,null,"Onder reparatie verstaan we het herstellen van een beschadigd of defect voorwerp of apparaat (zoals kleding, elektrische apparaten, fietsen of meubels). Het doel van reparatie is om het voorwerp of apparaat weer in goede staat te brengen, zodat het weer gebruikt kan worden zoals bedoeld."]
[]
[]
[]
[null,{"$f":"B229+1","v":17},{"$f":"CONCATENATE(\"Waar vinden reparaties plaats bij \",V13,\", en wie zijn de klanten (particulier of/en zakelijk)?\")","v":"Waar vinden reparaties plaats bij , en wie zijn de klanten (particulier of/en zakelijk)?"},null,null,null,null,null,null,null,null,null,null,null,null,null,null,null,null,null,null,null,null,null,null,null,null,null,null,null,null,null,null,null,null,null,null,null,null,null,null,null,null,null,{"$f":"IF(OR(COUNTIF(data!E153:G158,TRUE)>0,AV254=TRUE),1,0)","v":0}]
[]
[null,null,null,null,null,null,null,null,null,null,null,null,null,null,null,null,null,null,"Particulier",null,null,"Zakelijk"]
[null,null,"Door Repair Café(s)"]
[null,null,"Door werkplaats(en) binnen het sociale domein"]
[null,null,"Door de kringlooporganisatie(s)"]
[null,null,"Door een commercieel reparatiebedrijf of -reparatiebedrijven"]
[null,null,"Bij do it yourself werkhoek(en)"]
[null,null,"Anders, namelijk"]
[]
[null,null,"Er vindt (nog) geen reparatie plaats"]
[]
[null,null,{"$f":"IF(AV254=TRUE,CONCATENATE(\"Je gaf aan, dat er geen reparatie plaats vindt in uw circulair ambachtscentrum. Ga door naar vraag \",B343,\".\"),\"\")","v":""}]
[]
[null,{"$f":"B254+1","v":18},"Betalen particulieren voor de reparatieservice?",null,null,null,null,null,null,null,null,null,null,null,null,null,null,null,null,null,null,null,null,null,null,null,null,null,null,null,null,null,null,null,null,null,null,null,null,null,null,null,null,null,{"$f":"IF($AV$254=TRUE,\"nvt\",AS269)","v":0}]
[null,null,"Meerdere opties mogelijk.",null,null,null,null,null,null,null,null,null,null,null,null,null,null,null,null,null,null,null,null,null,null,null,null,null,null,null,null,null,null,null,null,null,null,null,null,null,null,null,null,null,{"$f":"IF(COUNTIFS(data!E149:F149,TRUE)>0,1,0)","v":0}]
[null,null,"De reparaties zijn gratis/op donatie. Voor vervangende onderdelen moet wel betaald worden."]
[null,null,"Voor reparaties betaalt de klant/bezoeker."]
[]
[null,null,"Opmerking:"]
[]
[]
[]
[null,{"$f":"B268+1","v":19},"Hoe werkt de reparatieservice voor particulieren?",null,null,null,null,null,null,null,null,null,null,null,null,null,null,null,null,null,null,null,null,null,null,null,null,null,null,null,null,null,null,null,null,null,null,null,null,null,null,null,null,null,{"$f":"IF($AV$254=TRUE,\"nvt\",AS278)","v":0}]
[null,null,"Meerdere opties mogelijk.",null,null,null,null,null,null,null,null,null,null,null,null,null,null,null,null,null,null,null,null,null,null,null,null,null,null,null,null,null,null,null,null,null,null,null,null,null,null,null,null,null,{"$f":"IF(COUNTIF(data!H149:J149,TRUE)>0,1,0)","v":0}]
[null,null,"Bezoekers kunnen hun spullen afgeven ter reparatie"]
[null,null,"Bezoekers repareren samen met vrijwilligers"]
[null,null,"Bezoekers hebben de keuze om bij de reparatie te zijn of om het product later weer op te halen."]
[]
[null,null,"Opmerking:"]
[]
[]
[]
[null,{"$f":"B277+1","v":20},{"$f":"CONCATENATE(\"Hoeveel Repair Café locaties zijn aangesloten bij \",V13,\"?\")","v":"Hoeveel Repair Café locaties zijn aangesloten bij ?"},null,null,null,null,null,null,null,null,null,null,null,null,null,null,null,null,null,null,null,null,null,null,null,null,null,null,null,null,null,"locaties van Repair Café",null,null,null,null,null,null,null,null,null,null,null,{"$f":"IF($AV$254=TRUE,\"nvt\",AS288)","v":0}]
[null,null,null,null,null,null,null,null,null,null,null,null,null,null,null,null,null,null,null,null,null,null,null,null,null,null,null,null,null,null,null,null,null,null,null,null,null,null,null,null,null,null,null,null,{"$f":"IF(AC287=\"\",0,1)","v":0}]
[null,{"$f":"B287+1","v":21},{"$f":"IF(AC287<2,\"Hoe vaak is het Repair Café geopend?\",\"Hoe vaak zijn de Repair Cafés geopend?\")","v":"Hoe vaak is het Repair Café geopend?"},null,null,null,null,null,null,null,null,null,null,null,null,null,null,null,null,null,null,null,null,null,null,null,null,null,null,null,null,null,null,null,null,null,null,null,null,null,null,null,null,null,{"$f":"IF($AV$254=TRUE,\"nvt\",AS290)","v":0}]
[null,null,"Bij meerdere Repair Café locaties: tel het aantal uren bij elkaar op.",null,null,null,null,null,null,null,null,null,null,null,null,null,null,null,null,null,null,null,null,null,null,null,null,null,null,null,null,null,null,null,null,null,null,null,null,null,null,null,null,null,{"$f":"IF(data!O149>0,1,0)","v":0}]
[]
[null,null,"Fulltime"]
[null,null,"Een aantal uur per week",null,null,null,null,null,null,null,null,null,null,"Geef aan hoe veel uur per week"]
[null,null,"Een aantal uur per maand",null,null,null,null,null,null,null,null,null,null,"Geef aan hoe veel uur per maand"]
[]
[null,null,"Opmerking:"]
[]
[]
[]
[]
[null,{"$f":"B289+1","v":22},"Worden de reparaties geregistreerd? (Bijvoorbeeld productcategorieën, wel of niet geslaagde reparatie, aantallen, reden van defect, etc.)",null,null,null,null,null,null,null,null,null,null,null,null,null,null,null,null,null,null,null,null,null,null,null,null,null,null,null,null,null,null,null,null,null,null,null,null,null,null,null,null,null,{"$f":"IF($AV$254=TRUE,\"nvt\",AS302)","v":0}]
[null,null,null,null,null,null,null,null,null,null,null,null,null,null,null,null,null,null,null,null,null,null,null,null,null,null,null,null,null,null,null,null,null,null,null,null,null,null,null,null,null,null,null,null,{"$f":"IF(COUNTIFS(data!Q149:T149,TRUE)>0,1,0)","v":0}]
[]
[null,null,"Ja digitaal, via een eigen administratie"]
[null,null,"Ja digitaal, via de Repair Monitor van Repair Café"]
[null,null,"Ja, in een fysiek boek"]
[null,null,"Nee",null,null,null,null,null,null,null,null,null,null,null,null,null,null,null,null,{"$f":"IF(R307=TRUE,CONCATENATE(\"Ga door naar vraag \",B343),\"\")","v":""}]
[]
[null,null,"Opmerking:"]
[]
[]
[]
[null,{"$f":"B301+1","v":23},{"$f":"CONCATENATE(\"Welke reparatie-initiatieven binnen \",V13,\" zijn gestart, lopen door of zijn gestopt? Licht kort toe.\")","v":"Welke reparatie-initiatieven binnen  zijn gestart, lopen door of zijn gestopt? Licht kort toe."},null,null,null,null,null,null,null,null,null,null,null,null,null,null,null,null,null,null,null,null,null,null,null,null,null,null,null,null,null,null,null,null,null,null,null,null,null,null,null,null,null,{"$f":"IF($AV$254=TRUE,\"nvt\",AS314)","v":0}]
[null,null,null,null,null,null,null,null,null,null,null,null,null,null,null,null,null,null,null,null,null,null,null,null,null,null,null,null,null,null,"Gestart in",null,null,"Loopt nog",null,null,"Gestopt in",null,null,null,null,null,null,null,{"$f":"IF(OR(AND(AS315=1,AT315=1),S327=TRUE),1,0)","v":0}]
[null,1,null,null,null,null,null,null,null,null,null,null,null,null,null,null,null,null,null,null,null,null,null,null,null,null,null,null,null,null,null,null,null,null,null,null,null,null,null,null,null,null,null,null,{"$f":"IF(AND(C315=\"\",AU327=FALSE),0,1)","v":0},{"$f":"IF(AND(data!E162<>0,data!F162<>0),1,0)","v":0}]
[null,{"$f":"B315+1","v":2}]
[null,{"$f":"B316+1","v":3}]
[null,{"$f":"B317+1","v":4}]
[null,{"$f":"B318+1","v":5}]
[null,{"$f":"B319+1","v":6}]
[null,{"$f":"B320+1","v":7}]
[null,8]
[null,9]
[null,10]
[null,11]
[]
[null,null,"Er zijn (nog) geen initiatieven gestart, doorlopend of gestopt",null,null,null,null,null,null,null,null,null,null,null,null,null,null,null,null,null,{"$f":"IF(AU327=TRUE,CONCATENATE(\"Ga door naar vraag \",B343,\".\"),\"\")","v":""}]
[]
[null,null,{"$f":"IF(AND(AK315=\"\",AK316=\"\",AK317=\"\",AK318=\"\",AK319=\"\",AK320=\"\",AK321=\"\",AK322=\"\",AK323=\"\",AK324=\"\",AK325=\"\"),CONCATENATE(\"Je gaf in vraag \",B313,\" aan, dat geen reparatie-initiatieven zijn gestopt. Vraag \",B331,\" is niet van toepassing. Ga door naar vraag \",B343,\".\"),\"\")","v":"Je gaf in vraag 23 aan, dat geen reparatie-initiatieven zijn gestopt. Vraag 24 is niet van toepassing. Ga door naar vraag 25."}]
[]
[null,{"$f":"B313+1","v":24},"Waarom zijn bepaalde reparatie initiatieven gestopt?",null,null,null,null,null,null,null,null,null,null,null,null,null,null,null,null,null,null,null,null,null,null,null,null,null,null,null,null,null,null,null,null,null,null,null,null,null,null,null,null,null,{"$f":"IF($AV$254=TRUE,\"nvt\",AS332)","v":0}]
[null,null,null,null,null,null,null,null,null,null,null,null,null,null,null,null,null,null,null,null,null,null,null,null,null,null,null,null,null,null,null,null,null,null,null,null,null,null,null,null,null,null,null,null,{"$f":"IF(S327=TRUE,\"nvt\",IF(C333=\"\",0,1))","v":0}]
[null,1]
[null,{"$f":"B333+1","v":2}]
[null,{"$f":"B334+1","v":3}]
[null,{"$f":"B335+1","v":4}]
[null,{"$f":"B336+1","v":5}]
[null,{"$f":"B337+1","v":6}]
[]
[]
[null,"Onderwijs en scholing"]
[]
[null,{"$f":"B331+1","v":25},{"$f":"CONCATENATE(\"Met welke soorten onderwijsinstellingen werkt \",V13,\" samen?\")","v":"Met welke soorten onderwijsinstellingen werkt  samen?"},null,null,null,null,null,null,null,null,null,null,null,null,null,null,null,null,null,null,null,null,null,null,null,null,null,null,null,null,null,null,null,null,null,null,null,null,null,null,null,null,null,{"$f":"IF(COUNTIF(data!D178:M178,TRUE)>0,1,0)","v":0}]
[null,null,"Meerdere antwoorden mogelijk"]
[]
[null,null,"Basisonderwijs",null,null,null,null,null,null,null,null,null,null,null,null,null,"Volwasseneneducatie",null,null,null,null,null,null,null,null,null,null,null,null,null,null,"anders, namelijk",null,null,null,null,null,null,null,null,null,null,null,null,null,"Basisonderwijs","Speciaal (voortgezet) onderwijs","Praktijkonderwijs","Vmbo","Havo","Vwo","Volwasseneneducatie","Mbo","Hbo","Universiteit","Werkontwikkelbedrijf/ praktijk leren","anders, namelijk","geen"]
[null,null,"Speciaal (voortgezet) onderwijs",null,null,null,null,null,null,null,null,null,null,null,null,null,"Mbo"]
[null,null,"Praktijkonderwijs",null,null,null,null,null,null,null,null,null,null,null,null,null,"Hbo",null,null,null,null,null,null,null,null,null,null,null,null,null,null,"Geen"]
[null,null,"Vmbo",null,null,null,null,null,null,null,null,null,null,null,null,null,"Universiteit"]
[null,null,"Havo",null,null,null,null,null,null,null,null,null,null,null,null,null,"Werkontwikkelbedrijf/ praktijk leren"]
[null,null,"Vwo"]
[]
[null,null,"Opmerking:"]
[]
[]
[]
[null,{"$f":"B343+1","v":26},"Op welke thema’s van de R-ladder wordt samengewerkt of zijn cursussen ontwikkeld?",null,null,null,null,null,null,null,null,null,null,null,null,null,null,null,null,null,null,null,null,null,null,null,null,null,null,null,null,null,null,null,null,null,null,null,null,null,null,null,null,null,{"$f":"IF(COUNTIF(data!S178:X178,TRUE)>0,1,0)","v":0}]
[]
[null,null,"Verkoop, weggeven of etaleren van tweedehands producten (hergebruik van producten)"]
[null,null,"Reparatie"]
[null,null,"Demontage van onderdelen om deze dan te gebruiken voor reparatie- of refurbishwerkzaamheden"]
[null,null,"Gebruik van tweedehands materialen en daarmee nieuwe producten maken (upcycling)",null,null,null,null,null,null,null,null,null,null,null,null,null,null,null,null,null,"definitie hergebruik"]
[null,null,"Het pimpen/refurbishen van producten (bijvoorbeeld een nieuwe laag verf op meubels aanbrengen)"]
[null,null,"Demontage ter behoeve van recycling"]
[null,null,"De samenwerking en/of cursussen zijn nog in ontwikkeling. Er vindt nog geen educatie plaats."]
[]
[null,null,"Opmerking:"]
[]
[]
[]
[null,null,{"$f":"IF(AU360,\"\",CONCATENATE(\"Je gaf aan, dat er geen educatie op het gebied van reparatie plaats vindt. Ga door naar vraag \",B405,\".\"))","v":"Je gaf aan, dat er geen educatie op het gebied van reparatie plaats vindt. Ga door naar vraag 29."}]
[]
[null,{"$f":"B357+1","v":27},{"$f":"CONCATENATE(\"Voor welke productgroepen biedt \",V13,\" een reparatieopleiding of reparatiecursussen aan?\")","v":"Voor welke productgroepen biedt  een reparatieopleiding of reparatiecursussen aan?"},null,null,null,null,null,null,null,null,null,null,null,null,null,null,null,null,null,null,null,null,null,null,null,null,null,null,null,null,null,null,null,null,null,null,null,null,null,null,null,null,null,{"$f":"IF(COUNTIF(data!AA178:AD178,TRUE)>0,1,0)","v":0}]
[]
[null,null,"Textiel"]
[null,null,"Elektrische apparaten"]
[null,null,"Meubels"]
[null,null,"Anders, namelijk "]
[]
[null,{"$f":"B373+1","v":28},"Voor welke doelgroepen zijn deze opleidingen of cursussen bedoeld?",null,null,null,null,null,null,null,null,null,null,null,null,null,null,null,null,null,null,null,null,null,null,null,null,null,null,null,null,null,null,null,null,null,null,null,null,null,null,null,null,null,{"$f":"IF(COUNTIF(data!AF178:AL178,TRUE)>0,1,0)","v":0}]
[]
[null,null,"Scholieren of studenten"]
[null,null,"Vervolgopleiding voor volwassenen"]
[null,null,"Medewerkers of vrijwilligers bij het Repair Café"]
[null,null,"Medewerkers of vrijwilligers bij de reparatiewerkplaats"]
[null,null,"Medewerkers in een werkontwikkelbedrijf"]
[null,null,"Particulieren/inwoners"]
[null,null,"Anders, namelijk"]
[]
[]
[null,"Inclusief werkgeverschap"]
[]
[null,null,"Inclusief werkgeverschap binnen een circulair ambachtscentrum betekent dat mensen die (nog) niet zelfstandig kunnen deelnemen aan het reguliere arbeidsproces, worden ondersteund bij het verrichten van maatschappelijk nuttige activiteiten of bij het deelnemen aan voortrajecten richting werk. Dit draagt bij aan het vergroten van zelfvertrouwen, het ontwikkelen van vaardigheden en het voorkomen van sociaal isolement. Dit vindt plaats na de leerplichtige leeftijd en vormt een belangrijke schakel richting participatie en arbeidsinschakeling.\n\nEen paar voorbeelden zijn:\n· Leerwerkplekken voor mensen met afstand tot de arbeidsmarkt\n· Zinvolle dagbesteding door deelname aan activiteiten zoals repareren van apparaten of meubels, helpen in een kringloopwinkel, of ondersteunen bij logistiek of materiaalstromen\n· Stages en opleidingsplekken voor alle schoolsoorten\n· Vrijwilligerswerk met behoud van uitkering\n· Werken aan duurzaamheid én sociale inclusie tegelijk"]
[]
[]
[]
[]
[]
[]
[]
[]
[]
[]
[]
[null,{"$f":"B380+1","v":29},{"$f":"CONCATENATE(\"Voor welke doelgroepen biedt \",V13,\" werkgelegenheid?\")","v":"Voor welke doelgroepen biedt  werkgelegenheid?"},null,null,null,null,null,null,null,null,null,null,null,null,null,null,null,null,null,null,null,null,null,null,null,null,null,null,null,null,null,null,null,null,null,null,null,null,null,null,null,null,null,{"$f":"IF(COUNTIF(data!D183:I183,TRUE)>0,1,0)","v":0}]
[]
[null,null,"Mensen zonder werk"]
[null,null,"Mensen met een arbeidsuitdaging"]
[null,null,"Mensen in opleiding"]
[null,null,"Mensen op zoek naar veiligheid"]
[null,null,"Vrijwilligers/overige medewerkers"]
[null,null,"Overige betaalde medewerkers"]
[]
[null,{"$f":"B405+1","v":30},{"$f":"CONCATENATE(\"Heeft \",V13,\" bijgedragen aan doorstroom naar betaald werk (binnen of buiten de organisatie)?\")","v":"Heeft  bijgedragen aan doorstroom naar betaald werk (binnen of buiten de organisatie)?"},null,null,null,null,null,null,null,null,null,null,null,null,null,null,null,null,null,null,null,null,null,null,null,null,null,null,null,null,null,null,null,null,null,null,null,null,null,null,null,null,null,{"$f":"IF(C416=\"\",0,1)","v":0}]
[]
[]
[]
[null,{"$f":"B414+1","v":31},{"$f":"CONCATENATE(\"Welke initiatieven voor inclusief werkgeverschap zijn binnen \",V13,\" gestart, lopen door of zijn gestopt? Licht kort toe.\")","v":"Welke initiatieven voor inclusief werkgeverschap zijn binnen  gestart, lopen door of zijn gestopt? Licht kort toe."},null,null,null,null,null,null,null,null,null,null,null,null,null,null,null,null,null,null,null,null,null,null,null,null,null,null,null,null,null,null,null,null,null,null,null,null,null,null,null,null,null,{"$f":"IF(OR(AND(AS421=1,AT421=1),AU433=TRUE),1,0)","v":0}]
[]
[null,null,null,null,null,null,null,null,null,null,null,null,null,null,null,null,null,null,null,null,null,null,null,null,null,null,null,null,null,null,"Gestart in",null,null,"Loopt nog",null,null,"Gestopt in"]
[null,1,null,null,null,null,null,null,null,null,null,null,null,null,null,null,null,null,null,null,null,null,null,null,null,null,null,null,null,null,null,null,null,null,null,null,null,null,null,null,null,null,null,null,{"$f":"IF(AND(C421=\"\",S433=FALSE),0,1)","v":0},{"$f":"IF(AND(data!E187<>0,data!F187<>0),1,0)","v":0},null,{"$f":"COUNT(AK421:AM431)","v":0}]
[null,{"$f":"B421+1","v":2}]
[null,{"$f":"B422+1","v":3}]
[null,{"$f":"B423+1","v":4}]
[null,{"$f":"B424+1","v":5}]
[null,{"$f":"B425+1","v":6}]
[null,{"$f":"B426+1","v":7}]
[null,8]
[null,9]
[null,10]
[null,11]
[]
[null,null,"Er zijn geen (nog) initiatieven gestart, doorlopend of gestopt"]
[]
[null,null,{"$f":"IF(S433=TRUE,CONCATENATE(\"Je gaf aan dat er geen initiatieven zijn gestopt of dat er nog geen initiatieven zijn gestart. Ga door naar vraag \",B446,\".\"),\"\")","v":""}]
[]
[null,{"$f":"B418+1","v":32},"Waarom zijn bepaalde initiatieven voor inclusief werkgeverschap gestopt? Licht kort toe waarom:",null,null,null,null,null,null,null,null,null,null,null,null,null,null,null,null,null,null,null,null,null,null,null,null,null,null,null,null,null,null,null,null,null,null,null,null,null,null,null,null,null,{"$f":"IF(AT439=\"nvt\",\"nvt\",IF(AS439=0,0,1))","v":"nvt"}]
[]
[null,1,null,null,null,null,null,null,null,null,null,null,null,null,null,null,null,null,null,null,null,null,null,null,null,null,null,null,null,null,null,null,null,null,null,null,null,null,null,null,null,null,null,null,{"$f":"IF(AND(AT439=1,C439=\"\"),0,1)","v":1},{"$f":"IF(OR(S433=TRUE,AT421<1),\"nvt\",IF(AV421>0,1,\"nvt\"))","v":"nvt"}]
[null,{"$f":"B439+1","v":2}]
[null,{"$f":"B440+1","v":3}]
[null,{"$f":"B441+1","v":4}]
[null,{"$f":"B442+1","v":5}]
[null,{"$f":"B443+1","v":6}]
[]
[null,{"$f":"B437+1","v":33},{"$f":"CONCATENATE(\"Bij welke partners van \",V13,\" zijn vrijwilligers betrokken bij activiteiten van het ambachtscentrum?\")","v":"Bij welke partners van  zijn vrijwilligers betrokken bij activiteiten van het ambachtscentrum?"},null,null,null,null,null,null,null,null,null,null,null,null,null,null,null,null,null,null,null,null,null,null,null,null,null,null,null,null,null,null,null,null,null,null,null,null,null,null,null,null,null,{"$f":"IF(AND(AU449=FALSE,C451=\"\"),0,1)","v":0}]
[null,null,"Kies uit het drop-down menu"]
[]
[null,null,"Geen"]
[]
[null,1,null,null,null,null,null,null,null,null,null,null,null,null,null,null,null,{"$f":"IF(C451<>\"\",\"ja\",\"nee\")","v":"nee"}]
[null,{"$f":"B451+1","v":2},null,null,null,null,null,null,null,null,null,null,null,null,null,null,null,{"$f":"IF(C452<>\"\",\"ja\",\"nee\")","v":"nee"}]
[null,{"$f":"B452+1","v":3},null,null,null,null,null,null,null,null,null,null,null,null,null,null,null,"nee"]
[null,{"$f":"B453+1","v":4},null,null,null,null,null,null,null,null,null,null,null,null,null,null,null,"nee"]
[null,{"$f":"B454+1","v":5},null,null,null,null,null,null,null,null,null,null,null,null,null,null,null,"nee"]
[null,{"$f":"B455+1","v":6},null,null,null,null,null,null,null,null,null,null,null,null,null,null,null,"nee"]
[null,{"$f":"B456+1","v":7},null,null,null,null,null,null,null,null,null,null,null,null,null,null,null,"nee"]
[null,8,null,null,null,null,null,null,null,null,null,null,null,null,null,null,null,"nee"]
[null,9,null,null,null,null,null,null,null,null,null,null,null,null,null,null,null,"nee"]
[null,{"$f":"B459+1","v":10},null,null,null,null,null,null,null,null,null,null,null,null,null,null,null,"nee"]
[]
[null,{"$f":"B446+1","v":34},"Geef per sociale partner aan wat voor soort organisatie dit is.",null,null,null,null,null,null,null,null,null,null,null,null,null,null,null,null,null,null,null,null,null,null,null,null,null,null,null,null,null,null,null,null,null,null,null,null,null,null,null,null,null,{"$f":"IF(AS464<>AT464,0,1)","v":{"$error":"#VALUE!"}}]
[]
[null,null,"Sociale partner",null,null,null,null,null,null,null,null,null,null,"Werkontwikkelbedrijf",null,null,null,null,null,null,"Sociale ondernemer",null,null,null,null,null,"Welzijnsorganisatie",null,null,null,null,null,null,null,null,null,null,null,null,null,null,null,null,null,{"$f":"BA478","v":0},{"$f":"SUM(AS465:AS477)","v":{"$error":"#VALUE!"}},null,null,null,null,{"$f":"C464","v":"Sociale partner"},"type","type_def"]
[null,null,{"$f":"IF(hulp!D4<>\"\",hulp!D4,\"\")","v":{"$error":"#VALUE!"}},null,null,null,null,null,null,null,null,null,null,null,null,null,null,null,null,null,null,null,null,null,null,null,null,null,null,null,null,null,null,null,null,null,null,null,null,null,null,null,null,null,{"$f":"IF(AND(C465<>\"\",AZ465<>0),1,0)","v":{"$error":"#VALUE!"}},null,null,null,null,null,{"$f":"C465","v":{"$error":"#VALUE!"}},null,{"$f":"IF(AY465=\"\",\"\",AZ465)","v":{"$error":"#VALUE!"}}]
[null,null,{"$f":"IF(hulp!D5<>\"\",hulp!D5,\"\")","v":""},null,null,null,null,null,null,null,null,null,null,null,null,null,null,null,null,null,null,null,null,null,null,null,null,null,null,null,null,null,null,null,null,null,null,null,null,null,null,null,null,null,{"$f":"IF(AND(C466<>\"\",AZ466<>0),1,0)","v":0},null,null,null,null,null,{"$f":"C466","v":""},null,{"$f":"IF(AY466=\"\",\"\",AZ466)","v":""}]
[null,null,{"$f":"IF(hulp!D6<>\"\",hulp!D6,\"\")","v":""},null,null,null,null,null,null,null,null,null,null,null,null,null,null,null,null,null,null,null,null,null,null,null,null,null,null,null,null,null,null,null,null,null,null,null,null,null,null,null,null,null,0,null,null,null,null,null,{"$f":"C467","v":""},null,""]
[null,null,{"$f":"IF(hulp!D7<>\"\",hulp!D7,\"\")","v":""},null,null,null,null,null,null,null,null,null,null,null,null,null,null,null,null,null,null,null,null,null,null,null,null,null,null,null,null,null,null,null,null,null,null,null,null,null,null,null,null,null,0,null,null,null,null,null,"",null,""]
[null,null,{"$f":"IF(hulp!D8<>\"\",hulp!D8,\"\")","v":""},null,null,null,null,null,null,null,null,null,null,null,null,null,null,null,null,null,null,null,null,null,null,null,null,null,null,null,null,null,null,null,null,null,null,null,null,null,null,null,null,null,0,null,null,null,null,null,"",null,""]
[null,null,{"$f":"IF(hulp!D9<>\"\",hulp!D9,\"\")","v":""},null,null,null,null,null,null,null,null,null,null,null,null,null,null,null,null,null,null,null,null,null,null,null,null,null,null,null,null,null,null,null,null,null,null,null,null,null,null,null,null,null,0,null,null,null,null,null,"",null,""]
[null,null,{"$f":"IF(hulp!D10<>\"\",hulp!D10,\"\")","v":""},null,null,null,null,null,null,null,null,null,null,null,null,null,null,null,null,null,null,null,null,null,null,null,null,null,null,null,null,null,null,null,null,null,null,null,null,null,null,null,null,null,0,null,null,null,null,null,"",null,""]
[null,null,{"$f":"IF(hulp!D11<>\"\",hulp!D11,\"\")","v":""},null,null,null,null,null,null,null,null,null,null,null,null,null,null,null,null,null,null,null,null,null,null,null,null,null,null,null,null,null,null,null,null,null,null,null,null,null,null,null,null,null,0,null,null,null,null,null,"",null,""]
[null,null,{"$f":"IF(hulp!D12<>\"\",hulp!D12,\"\")","v":""},null,null,null,null,null,null,null,null,null,null,null,null,null,null,null,null,null,null,null,null,null,null,null,null,null,null,null,null,null,null,null,null,null,null,null,null,null,null,null,null,null,0,null,null,null,null,null,"",null,""]
[null,null,{"$f":"IF(hulp!D13<>\"\",hulp!D13,\"\")","v":""},null,null,null,null,null,null,null,null,null,null,null,null,null,null,null,null,null,null,null,null,null,null,null,null,null,null,null,null,null,null,null,null,null,null,null,null,null,null,null,null,null,0,null,null,null,null,null,{"$f":"C474","v":""},null,""]
[null,null,{"$f":"IF(hulp!D14<>\"\",hulp!D14,\"\")","v":""},null,null,null,null,null,null,null,null,null,null,null,null,null,null,null,null,null,null,null,null,null,null,null,null,null,null,null,null,null,null,null,null,null,null,null,null,null,null,null,null,null,0,null,null,null,null,null,"",null,""]
[null,null,{"$f":"IF(hulp!D15<>\"\",hulp!D15,\"\")","v":""},null,null,null,null,null,null,null,null,null,null,null,null,null,null,null,null,null,null,null,null,null,null,null,null,null,null,null,null,null,null,null,null,null,null,null,null,null,null,null,null,null,0,null,null,null,null,null,"",null,{"$f":"IF(AY476=\"\",\"\",AZ476)","v":""}]
[null,null,{"$f":"IF(hulp!D16<>\"\",hulp!D16,\"\")","v":""},null,null,null,null,null,null,null,null,null,null,null,null,null,null,null,null,null,null,null,null,null,null,null,null,null,null,null,null,null,null,null,null,null,null,null,null,null,null,null,null,null,0,null,null,null,null,null,"",null,""]
[null,null,null,null,null,null,null,null,null,null,null,null,null,null,null,null,null,null,null,null,null,null,null,null,null,null,null,null,null,null,null,null,null,null,null,null,null,null,null,null,null,null,null,null,null,null,null,null,null,null,null,null,{"$f":"COUNT(BA465:BA477)","v":0}]
[null,{"$f":"B462+1","v":35},{"$f":"CONCATENATE(\"Geef per sociale partner aan of deze lid is van Cedris op 31.12.\",RIGHT(M7,4),\".\")","v":"Geef per sociale partner aan of deze lid is van Cedris op 31.12.2025."},null,null,null,null,null,null,null,null,null,null,null,null,null,null,null,null,null,null,null,null,null,null,null,null,null,null,null,null,null,null,null,null,null,null,null,null,null,null,null,null,null,{"$f":"IF(AS481<>AT481,0,1)","v":{"$error":"#VALUE!"}}]
[]
[null,null,"Sociale partner",null,null,null,null,null,null,null,null,null,null,"Lid van Cedris",null,null,null,null,null,"Geen lid van Cedris",null,null,null,null,null,null,null,null,null,null,null,null,null,null,null,null,null,null,null,null,null,null,null,null,{"$f":"BA495","v":0},{"$f":"SUM(AS482:AS494)","v":{"$error":"#VALUE!"}},null,null,null,null,{"$f":"C481","v":"Sociale partner"},"lid","lid_def"]
[null,null,{"$f":"IF(hulp!D4<>\"\",hulp!D4,\"\")","v":{"$error":"#VALUE!"}},null,null,null,null,null,null,null,null,null,null,null,null,null,null,null,null,null,null,null,null,null,null,null,null,null,null,null,null,null,null,null,null,null,null,null,null,null,null,null,null,null,{"$f":"IF(AND(C482<>\"\",AZ482<>0),1,0)","v":{"$error":"#VALUE!"}},null,null,null,null,null,{"$f":"C482","v":{"$error":"#VALUE!"}},null,{"$f":"IF(AY482=\"\",\"\",AZ482)","v":{"$error":"#VALUE!"}},{"$f":"IF(BA482=0,\"niet bekend\",IF(BA482=1,TRUE,IF(BA482=2,FALSE,IF(BA482=\"\",\"\"))))","v":{"$error":"#VALUE!"}}]
[null,null,{"$f":"IF(hulp!D5<>\"\",hulp!D5,\"\")","v":""},null,null,null,null,null,null,null,null,null,null,null,null,null,null,null,null,null,null,null,null,null,null,null,null,null,null,null,null,null,null,null,null,null,null,null,null,null,null,null,null,null,{"$f":"IF(AND(C483<>\"\",AZ483<>0),1,0)","v":0},null,null,null,null,null,{"$f":"C483","v":""},null,{"$f":"IF(AY483=\"\",\"\",AZ483)","v":""},{"$f":"IF(BA483=0,\"niet bekend\",IF(BA483=1,TRUE,IF(BA483=2,FALSE,IF(BA483=\"\",\"\"))))","v":""}]
[null,null,{"$f":"IF(hulp!D6<>\"\",hulp!D6,\"\")","v":""},null,null,null,null,null,null,null,null,null,null,null,null,null,null,null,null,null,null,null,null,null,null,null,null,null,null,null,null,null,null,null,null,null,null,null,null,null,null,null,null,null,0,null,null,null,null,null,{"$f":"C484","v":""},null,"",""]
[null,null,{"$f":"IF(hulp!D7<>\"\",hulp!D7,\"\")","v":""},null,null,null,null,null,null,null,null,null,null,null,null,null,null,null,null,null,null,null,null,null,null,null,null,null,null,null,null,null,null,null,null,null,null,null,null,null,null,null,null,null,0,null,null,null,null,null,"",null,"",""]
[null,null,{"$f":"IF(hulp!D8<>\"\",hulp!D8,\"\")","v":""},null,null,null,null,null,null,null,null,null,null,null,null,null,null,null,null,null,null,null,null,null,null,null,null,null,null,null,null,null,null,null,null,null,null,null,null,null,null,null,null,null,0,null,null,null,null,null,"",null,"",""]
[null,null,{"$f":"IF(hulp!D9<>\"\",hulp!D9,\"\")","v":""},null,null,null,null,null,null,null,null,null,null,null,null,null,null,null,null,null,null,null,null,null,null,null,null,null,null,null,null,null,null,null,null,null,null,null,null,null,null,null,null,null,0,null,null,null,null,null,"",null,"",""]
[null,null,{"$f":"IF(hulp!D10<>\"\",hulp!D10,\"\")","v":""},null,null,null,null,null,null,null,null,null,null,null,null,null,null,null,null,null,null,null,null,null,null,null,null,null,null,null,null,null,null,null,null,null,null,null,null,null,null,null,null,null,0,null,null,null,null,null,"",null,"",""]
[null,null,{"$f":"IF(hulp!D11<>\"\",hulp!D11,\"\")","v":""},null,null,null,null,null,null,null,null,null,null,null,null,null,null,null,null,null,null,null,null,null,null,null,null,null,null,null,null,null,null,null,null,null,null,null,null,null,null,null,null,null,0,null,null,null,null,null,"",null,"",""]
[null,null,{"$f":"IF(hulp!D12<>\"\",hulp!D12,\"\")","v":""},null,null,null,null,null,null,null,null,null,null,null,null,null,null,null,null,null,null,null,null,null,null,null,null,null,null,null,null,null,null,null,null,null,null,null,null,null,null,null,null,null,0,null,null,null,null,null,"",null,"",""]
[null,null,{"$f":"IF(hulp!D13<>\"\",hulp!D13,\"\")","v":""},null,null,null,null,null,null,null,null,null,null,null,null,null,null,null,null,null,null,null,null,null,null,null,null,null,null,null,null,null,null,null,null,null,null,null,null,null,null,null,null,null,0,null,null,null,null,null,"",null,"",""]
[null,null,{"$f":"IF(hulp!D14<>\"\",hulp!D14,\"\")","v":""},null,null,null,null,null,null,null,null,null,null,null,null,null,null,null,null,null,null,null,null,null,null,null,null,null,null,null,null,null,null,null,null,null,null,null,null,null,null,null,null,null,0,null,null,null,null,null,"",null,"",""]
[null,null,{"$f":"IF(hulp!D15<>\"\",hulp!D15,\"\")","v":""},null,null,null,null,null,null,null,null,null,null,null,null,null,null,null,null,null,null,null,null,null,null,null,null,null,null,null,null,null,null,null,null,null,null,null,null,null,null,null,null,null,0,null,null,null,null,null,"",null,"",{"$f":"IF(BA493=0,\"niet bekend\",IF(BA493=1,TRUE,IF(BA493=2,FALSE,IF(BA493=\"\",\"\"))))","v":""}]
[null,null,{"$f":"IF(hulp!D16<>\"\",hulp!D16,\"\")","v":""},null,null,null,null,null,null,null,null,null,null,null,null,null,null,null,null,null,null,null,null,null,null,null,null,null,null,null,null,null,null,null,null,null,null,null,null,null,null,null,null,null,0,null,null,null,null,null,"",null,"",""]
[null,null,null,null,null,null,null,null,null,null,null,null,null,null,null,null,null,null,null,null,null,null,null,null,null,null,null,null,null,null,null,null,null,null,null,null,null,null,null,null,null,null,null,null,null,null,null,null,null,null,null,null,{"$f":"COUNT(BA482:BA494)","v":0}]
[null,{"$f":"B479+1","v":36},{"$f":"CONCATENATE(\"Hoe veel FTE uit de PSO-doelgroep werkte mee aan activiteiten van \",V13,\" op 31.12.\",RIGHT(M7,4)-1,\" en op 31.12.\",RIGHT(M7,4),\"?\")","v":"Hoe veel FTE uit de PSO-doelgroep werkte mee aan activiteiten van  op 31.12.2024 en op 31.12.2025?"},null,null,null,null,null,null,null,null,null,null,null,null,null,null,null,null,null,null,null,null,null,null,null,null,null,null,null,null,null,null,null,null,null,null,null,null,null,null,null,null,null,{"$f":"IF(SUM(AS501:AS502)=2,1,0)","v":0}]
[null,null,"In de PSO-doelgroep vallen mensen zonder werk, mensen met een arbeidsuitdaging, mensen in opleiding en mensen op zoek naar veiligheid."]
[null,null,"Het gaat om PSO-medewerkers van alle partners die in hun functie bijdragen aan activiteiten van het circulair ambachtscentrum."]
[null,null,"Voorbeeld: een medewerker van de milieustraat die inkomende goederen beoordeelt op herbruikbaarheid telt mee, mits de persoon in de PSO-doelgroep valt. Een milieustraatmedewerker die bezoekers helpt om afval te sorteren draagt niet bij aan CA activiteiten. "]
[]
[null,null,{"$f":"CONCATENATE(\"31.12.\",RIGHT(M7,4)-1)","v":"31.12.2024"},null,null,null,null,null,null,null,null,"aantal FTE PSO-doelgroep",null,null,null,null,null,null,null,null,null,null,{"$f":"CONCATENATE(\"Niet bekend voor \",RIGHT(M7,4)-1,\"/\",V13,\" bestond toen nog niet\")","v":"Niet bekend voor 2024/ bestond toen nog niet"},null,null,null,null,null,null,null,null,null,null,null,null,null,null,null,null,null,null,null,null,null,{"$f":"IF(AND(H501=\"\",AU501=FALSE),0,1)","v":0}]
[null,null,{"$f":"CONCATENATE(\"31.12.\",RIGHT(M7,4))","v":"31.12.2025"},null,null,null,null,null,null,null,null,"aantal FTE PSO-doelgroep",null,null,null,null,null,null,null,null,null,null,{"$f":"CONCATENATE(\"Niet bekend voor \",RIGHT(M7,4),\"/\",V13,\" bestond toen nog niet\")","v":"Niet bekend voor 2025/ bestond toen nog niet"},null,null,null,null,null,null,null,null,null,null,null,null,null,null,null,null,null,null,null,null,null,{"$f":"IF(AND(H502=\"\",AU502=FALSE),0,1)","v":0}]
[]
[null,null,"Opmerking:"]
[]
[]
[]
[]
[null,{"$f":"B496+1","v":37},{"$f":"CONCATENATE(\"Hoeveel personen vanuit werkontwikkelbedrijven werkten in het ambachtscentrum op 31.12.\",RIGHT(M7,4)-1,\" en op 31.12.\",RIGHT(M7,4),\"?\")","v":"Hoeveel personen vanuit werkontwikkelbedrijven werkten in het ambachtscentrum op 31.12.2024 en op 31.12.2025?"},null,null,null,null,null,null,null,null,null,null,null,null,null,null,null,null,null,null,null,null,null,null,null,null,null,null,null,null,null,null,null,null,null,null,null,null,null,null,null,null,null,{"$f":"IF(SUM(AS511:AS512)=2,1,0)","v":0}]
[]
[null,null,{"$f":"CONCATENATE(\"31.12.\",RIGHT(M7,4)-1)","v":"31.12.2024"},null,null,null,null,null,null,null,null,null,"aantal personen",null,null,null,null,null,null,null,null,null,{"$f":"CONCATENATE(\"Niet bekend voor \",RIGHT(M7,4)-1,\"/\",V13,\" bestond toen nog niet\")","v":"Niet bekend voor 2024/ bestond toen nog niet"},null,null,null,null,null,null,null,null,null,null,null,null,null,null,null,null,null,null,null,null,null,{"$f":"IF(AND(H511=\"\",AU511=FALSE),0,1)","v":0}]
[null,null,{"$f":"CONCATENATE(\"31.12.\",RIGHT(M7,4))","v":"31.12.2025"},null,null,null,null,null,null,null,null,null,"aantal personen",null,null,null,null,null,null,null,null,null,{"$f":"CONCATENATE(\"Niet bekend voor \",RIGHT(M7,4),\"/\",V13,\" bestond toen nog niet\")","v":"Niet bekend voor 2025/ bestond toen nog niet"},null,null,null,null,null,null,null,null,null,null,null,null,null,null,null,null,null,null,null,null,null,{"$f":"IF(AND(H512=\"\",AU512=FALSE),0,1)","v":0}]
[]
[]
[null,{"$f":"B509+1","v":38},{"$f":"CONCATENATE(\"Hoe veel leerwerktrajecten biedt \",V13,\" aan in \",RIGHT(M7,4),\"?\")","v":"Hoe veel leerwerktrajecten biedt  aan in 2025?"},null,null,null,null,null,null,null,null,null,null,null,null,null,null,null,null,null,null,null,null,null,null,null,null,null,null,null,null,null,null,null,null,null,null,null,null,null,null,null,null,null,{"$f":"IF(AND(AS517=1,AS525=1),1,IF(AND(AS517=1,AS520=1,AS521=1),1,0))","v":0}]
[]
[null,null,null,null,null,null,null,"aantal plekken/ deelnemers",null,null,null,null,null,null,null,null,null,null,null,null,null,null,{"$f":"CONCATENATE(\"Niet bekend voor \",RIGHT(M7,4),\"/\",V13,\" bestond toen nog niet\")","v":"Niet bekend voor 2025/ bestond toen nog niet"},null,null,null,null,null,null,null,null,null,null,null,null,null,null,null,null,null,null,null,null,null,{"$f":"IF(C517=\"\",0,1)","v":0}]
[]
[null,null,"daarvan zijn:"]
[null,null,null,null,null,null,null,"plekken via werkontwikkelbedrijven",null,null,null,null,null,null,null,null,null,null,null,null,null,null,{"$f":"CONCATENATE(\"Niet bekend voor \",RIGHT(M7,4),\"/\",V13,\" bestond toen nog niet\")","v":"Niet bekend voor 2025/ bestond toen nog niet"},null,null,null,null,null,null,null,null,null,null,null,null,null,null,null,null,null,null,null,null,null,{"$f":"IF(AND(C520=\"\",AU520=FALSE),0,1)","v":0}]
[null,null,null,null,null,null,null,"plekken via loonsubsidie",null,null,null,null,null,null,null,null,null,null,null,null,null,null,null,null,null,null,null,null,null,null,null,null,null,null,null,null,null,null,null,null,null,null,null,null,{"$f":"IF(AND(C521=\"\",AU520=FALSE),0,1)","v":0}]
[]
[null,null,{"$f":"IF(AND(AU525=FALSE,(C520+C521)<>C517),\"Let op de ingevulde waardes zijn niet gelijk met het aantal plekken!\",\"\")","v":""}]
[]
[null,null,null,null,"De aantallen per ontwikkelbedrijf of loonsubsidie zijn niet bekend, maar wij kunnen een percentage aangeven.",null,null,null,null,null,null,null,null,null,null,null,null,null,null,null,null,null,null,null,null,null,null,null,null,null,null,null,null,null,null,null,null,null,null,null,null,null,null,null,{"$f":"IF(AND(C520=\"\",C521=\"\",AU520=FALSE,AU525=TRUE,SUM(C528:F529)=1),1,0)","v":0}]
[]
[null,null,"daarvan zijn:"]
[null,null,null,null,null,null,null,"percent via werkontwikkelbedrijven"]
[null,null,null,null,null,null,null,"percent via loonsubsidie"]
[]
[null,null,{"$f":"IF(AND(C525=TRUE,(C528+C529)<>1),\"Let op de ingevulde waardes tellen niet op tot 100%!\",\"\")","v":""}]
[]
[]
[null,"Economisch"]
[]
[null,{"$f":"B515+1","v":39},{"$f":"CONCATENATE(\"Welke diensten biedt \",V13,\" aan voor particuliere en zakelijke klanten?\")","v":"Welke diensten biedt  aan voor particuliere en zakelijke klanten?"},null,null,null,null,null,null,null,null,null,null,null,null,null,null,null,null,null,null,null,null,null,null,null,null,null,null,null,null,null,null,null,null,null,null,null,null,null,null,null,null,null,{"$f":"IF(COUNTIF(data!D202:W202,TRUE)>0,1,0)","v":0}]
[]
[null,null,"Betaalde cursussen voor volwassenen (denk hier aan meubelbouw, naaicursus, reparatie etc.)"]
[null,null,"Bezorgservice voor particulieren"]
[null,null,"Exposities"]
[null,null,"Horeca"]
[null,null,"Lespaketten"]
[null,null,"Logistieke services binnen de samenwerking tussen de partners"]
[null,null,"Ophaalservices voor particulieren"]
[null,null,"Reparatieservice"]
[null,null,"(Betaalde) rondleidingen"]
[null,null,"Teambuilding"]
[null,null,"Uitleenservice (delen en/of lenen van bijvoorbeeld fietsen, speelgoed, gereedschap etc.)"]
[null,null,"Verhuur van ruimtes voor vergaderingen, evenementen etc."]
[null,null,"Verhuur van werkplaatsen"]
[null,null,"Verkoop van tweedehands producten en materialen"]
[null,null,"Webshop"]
[null,null,"Weggeefwinkel"]
[null,null,"Anders, namelijk"]
[null,null,"Anders, namelijk"]
[null,null,"Anders, namelijk"]
[null,null,"Anders, namelijk"]
[]
[]
[null,{"$f":"B536+1","v":40},{"$f":"CONCATENATE(\"Wat is in \",RIGHT(M7,4),\" de verhouding tussen Business to Business (B2B-), en Business to Consumer (B2C-) omzet van de 5 grootste ondernemende partners van \",V13,\"?\")","v":"Wat is in 2025 de verhouding tussen Business to Business (B2B-), en Business to Consumer (B2C-) omzet van de 5 grootste ondernemende partners van ?"},null,null,null,null,null,null,null,null,null,null,null,null,null,null,null,null,null,null,null,null,null,null,null,null,null,null,null,null,null,null,null,null,null,null,null,null,null,null,null,null,null,{"$f":"IF(AU572=TRUE,1,IF(AND(C566<>\"\",Q566=100),1,0))","v":0}]
[]
[null,null,"Kies de ondernemende partners uit het drop-down menu.\nEén van de doelen van het programma Circulaire Ambachtscentra is levensduurverlening van producten en materialen. Rijkswaterstaat is benieuwd naar de balans tussen de afzet van de producten in het gebruikte business model. Rijswaterstaat heeft geen oordeel over de verhouding tussen B2B en B2C."]
[]
[]
[null,null,"Ondernemende partners",null,null,null,null,null,null,null,"% B2B",null,null,"% B2C",null,null,"% totaal"]
[null,1,null,null,null,null,null,null,null,null,null,null,null,null,null,null,{"$f":"K566+N566","v":0}]
[null,{"$f":"B566+1","v":2},null,null,null,null,null,null,null,null,null,null,null,null,null,null,{"$f":"K567+N567","v":0}]
[null,{"$f":"B567+1","v":3},null,null,null,null,null,null,null,null,null,null,null,null,null,null,{"$f":"K568+N568","v":0}]
[null,{"$f":"B568+1","v":4},null,null,null,null,null,null,null,null,null,null,null,null,null,null,{"$f":"K569+N569","v":0}]
[null,{"$f":"B569+1","v":5},null,null,null,null,null,null,null,null,null,null,null,null,null,null,{"$f":"K570+N570","v":0}]
[]
[null,null,{"$f":"CONCATENATE(\"Deze gegevens worden niet met de contactpersoon voor \",V13,\" gedeeld\")","v":"Deze gegevens worden niet met de contactpersoon voor  gedeeld"}]
[]
[null,{"$f":"B560+1","v":41},{"$f":"CONCATENATE(\"Maak(te) \",V13,\" gebruik van impuls-/start up subsidies in \",RIGHT(M7,4),\"?\")","v":"Maak(te)  gebruik van impuls-/start up subsidies in 2025?"},null,null,null,null,null,null,null,null,null,null,null,null,null,null,null,null,null,null,null,null,null,null,null,null,null,null,null,null,null,null,null,null,null,null,null,null,null,null,null,null,null,{"$f":"IF(COUNTIF(data!AC202:AK202,TRUE)>0,1,0)","v":0}]
[null,null,"Meerdere antwoorden mogelijk"]
[null,null,"Ja, van het Minsterie van Infrastructur en Waterstaat/Rijkswaterstaat"]
[null,null,"Ja, van een andere subsidie van het Rijk (anders dan de SPUK circulair ambachtscentrum)"]
[null,null,"Ja, van een subsidie van de provincie"]
[null,null,"Ja, van een subsidie van de gemeente"]
[null,null,"Ja, van een subsidie van de EU"]
[null,null,"Ja, van stichtingen en goede doelen"]
[null,null,"Nee"]
[null,null,"Anders, namelijk"]
[]
[null,{"$f":"B574+1","v":42},{"$f":"CONCATENATE(\"Maak(te) \",V13,\" vóór \",RIGHT(M7,4),\" gebruik van dergelijke subsidies, dus in \",RIGHT(M7,4)-1,\" of eerdere jaren?\")","v":"Maak(te)  vóór 2025 gebruik van dergelijke subsidies, dus in 2024 of eerdere jaren?"},null,null,null,null,null,null,null,null,null,null,null,null,null,null,null,null,null,null,null,null,null,null,null,null,null,null,null,null,null,null,null,null,null,null,null,null,null,null,null,null,null,{"$f":"IF(COUNTIF(data!AL202:AT202,TRUE)>0,1,0)","v":0}]
[null,null,"Meerdere antwoorden mogelijk"]
[]
[null,null,"Ja, van het Minsterie van Infrastructur en Waterstaat/ Rijkswaterstaat"]
[null,null,"Ja, van een andere subsidie van het Rijk"]
[null,null,"Ja, van een subsidie van de provincie"]
[null,null,"Ja, van een subsidie van de gemeente"]
[null,null,"Ja, van een subsidie van de EU"]
[null,null,"Ja, van stichtingen en goede doelen"]
[null,null,"Nee"]
[null,null,"Anders, namelijk"]
[null,null,{"$f":"IF(AU582=TRUE,CONCATENATE(\"U geeft aan, geen impuls-/start up subsidies in \",RIGHT(M7,4),\" ontvangen te hebben. Ga door naar vraag \",B606),\"\")","v":""}]
[]
[null,{"$f":"B585+1","v":43},{"$f":"CONCATENATE(\"Was \",V13,\" in \",RIGHT(M7,4),\" afhankelijk van deze subsidie(s) voor….?\")","v":"Was  in 2025 afhankelijk van deze subsidie(s) voor….?"},null,null,null,null,null,null,null,null,null,null,null,null,null,null,null,null,null,null,null,null,null,null,null,null,null,null,null,null,null,null,null,null,null,null,null,null,null,null,null,null,null,{"$f":"IF(Z582=TRUE,\"nvt\",IF(COUNTIF(data!AU202:AX202,0)>0,0,1))","v":0}]
[null,null,"Kies een antwoord voor elk vak"]
[]
[null,null,"Het opstarten"]
[null,null,"Voor ontwikkeling/ uitbreiden"]
[null,null,"Onderzoek en begeleiding"]
[null,null,"Het bestaan"]
[]
[null,{"$f":"B598+1","v":44},{"$f":"CONCATENATE(\"Hoe goed is de structurele financering van \",V13,\" richting \",RIGHT(M7,4)+6,\" geborgd?\")","v":"Hoe goed is de structurele financering van  richting 2031 geborgd?"},null,null,null,null,null,null,null,null,null,null,null,null,null,null,null,null,null,null,null,null,null,null,null,null,null,null,null,null,null,null,null,null,null,null,null,null,null,null,null,null,null,{"$f":"IF(COUNTIF(data!AY202:BC202,TRUE)>0,1,0)","v":0}]
[]
[null,null,"De structurele financering is geborgd voor de komende 5 jaar"]
[null,null,"De structurele financering is alleen voor de korte termijn geborgd en nog niet voor de komende 5 jaar"]
[null,null,"We zijn bezig om de structurele financering vorm te geven"]
[null,null,"We plannen maar één jaar voorruit"]
[null,null,"We hebben daar nog niet over nagedacht"]
[null,null,"Anders, namelijk"]
[]
[null,{"$f":"B606+1","v":45},{"$f":"CONCATENATE(\"Heeft een vertegenwoordiger van \",V13,\" deelgenomen aan de cursus 'value cases voor circulaire ambachtscentra'?\")","v":"Heeft een vertegenwoordiger van  deelgenomen aan de cursus 'value cases voor circulaire ambachtscentra'?"},null,null,null,null,null,null,null,null,null,null,null,null,null,null,null,null,null,null,null,null,null,null,null,null,null,null,null,null,null,null,null,null,null,null,null,null,null,null,null,null,null,{"$f":"IF(C617=\"\",0,1)","v":0}]
[]
[]
[]
[null,{"$f":"B615+1","v":46},{"$f":"CONCATENATE(\"Is \",V13,\" al bezig met het in beeld brengen van de value case? Dit houdt in dat u de sociale en ecologische meerwaarde van uw circulaire ambachtscentrum al in cijfers heeft kunnen uitdrukken.\")","v":"Is  al bezig met het in beeld brengen van de value case? Dit houdt in dat u de sociale en ecologische meerwaarde van uw circulaire ambachtscentrum al in cijfers heeft kunnen uitdrukken."},null,null,null,null,null,null,null,null,null,null,null,null,null,null,null,null,null,null,null,null,null,null,null,null,null,null,null,null,null,null,null,null,null,null,null,null,null,null,null,null,null,{"$f":"IF(data!BG202=0,0,1)","v":0}]
[]
[]
[null,null,"Ja"]
[null,null,"Ja, maar anders dan in de cursus"]
[null,null,"Nee"]
[null,null,"Niet van toepassing"]
[]
[]
[null,"Bekendheid bij publiek"]
[]
[null,{"$f":"B619+1","v":47},{"$f":"CONCATENATE(\"Is \",V13,\" online aanwezig op één of meerdere kanalen?\")","v":"Is  online aanwezig op één of meerdere kanalen?"},null,null,null,null,null,null,null,null,null,null,null,null,null,null,null,null,null,null,null,null,null,null,null,null,null,null,null,null,null,null,null,null,null,null,null,null,null,null,null,null,null,{"$f":"IF(COUNTIF(AU635:AU640,TRUE)>0,1,0)","v":0}]
[null,null,{"$f":"CONCATENATE(\"Zo ja, geef ook het webadres aan en het aantal bezoekers of volgers in \",RIGHT(M7,4))","v":"Zo ja, geef ook het webadres aan en het aantal bezoekers of volgers in 2025"}]
[null,null,"Het gaat om online aanwezigheid als geheel circulair ambachtscentrum, niet van de individuele partners."]
[]
[null,null,null,null,null,null,null,null,null,null,null,"Link"]
[null,null,"Eigen website",null,null,null,null,null,null,null,null,null,null,null,null,null,null,null,null,null,null,null,null,"aantal bezoekers",null,null,null,null,null,null,null,"aantal bezoekers onbekend"]
[null,null,"Facebook",null,null,null,null,null,null,null,null,null,null,null,null,null,null,null,null,null,null,null,null,"aantal volgers",null,null,null,null,null,null,null,"aantal volgers onbekend"]
[null,null,"Instagram",null,null,null,null,null,null,null,null,null,null,null,null,null,null,null,null,null,null,null,null,"aantal volgers",null,null,null,null,null,null,null,"aantal volgers onbekend"]
[null,null,"X",null,null,null,null,null,null,null,null,null,null,null,null,null,null,null,null,null,null,null,null,"aantal volgers",null,null,null,null,null,null,null,"aantal volgers onbekend"]
[null,null,"LinkedIn",null,null,null,null,null,null,null,null,null,null,null,null,null,null,null,null,null,null,null,null,"aantal volgers",null,null,null,null,null,null,null,"aantal volgers onbekend"]
[null,null,"Niet aanwezig op deze kanalen"]
[]
[null,null,"Opmerking:"]
[]
[]
[]
[null,{"$f":"B630+1","v":48},{"$f":"CONCATENATE(\"Hoe veel berichten zijn over \",V13,\" in \",RIGHT(M7,4)-1,\" en \",RIGHT(M7,4),\" gepubliceerd?\")","v":"Hoe veel berichten zijn over  in 2024 en 2025 gepubliceerd?"},null,null,null,null,null,null,null,null,null,null,null,null,null,null,null,null,null,null,null,null,null,null,null,null,null,null,null,null,null,null,null,null,null,null,null,null,null,null,null,null,null,{"$f":"IF(AND(data!F215<>0,data!G215<>0),1,0)","v":0}]
[null,null,{"$f":"CONCATENATE(\"Het gaat hier om berichten die \",V13,\" zelf publiceert, maar ook om berichten van partners of derden, bijvoorbeeld lokale kranten, die over \",V13,\" berichten.\")","v":"Het gaat hier om berichten die  zelf publiceert, maar ook om berichten van partners of derden, bijvoorbeeld lokale kranten, die over  berichten."}]
[]
[]
[null,null,{"$f":"CONCATENATE(\"Aantal berichten in \",RIGHT(M7,4)-1)","v":"Aantal berichten in 2024"},null,null,null,null,null,null,null,null,null,null,null,null,{"$f":"CONCATENATE(\"Aantal berichten in \",RIGHT(M7,4)-1,\" is onbekend\")","v":"Aantal berichten in 2024 is onbekend"}]
[null,null,{"$f":"CONCATENATE(\"Aantal berichten in \",RIGHT(M7,4))","v":"Aantal berichten in 2025"},null,null,null,null,null,null,null,null,null,null,null,null,{"$f":"CONCATENATE(\"Aantal berichten in \",RIGHT(M7,4),\" is onbekend\")","v":"Aantal berichten in 2025 is onbekend"}]
[]
[null,null,"Opmerking:"]
[]
[]
[]
[null,{"$f":"B646+1","v":49},"Rijkswaterstaat wil graag kwantitatief in kaart brengen hoe zich de bekendheid van circulaire ambachtscentra ontwikkelt.",null,null,null,null,null,null,null,null,null,null,null,null,null,null,null,null,null,null,null,null,null,null,null,null,null,null,null,null,null,null,null,null,null,null,null,null,null,null,null,null,null,{"$f":"IF(C661<>\"\",1,0)","v":0}]
[null,null,{"$f":"CONCATENATE(\"De vragen \",B630,\" en \",B646,\" zijn indirecte indicatoren. Wordt bij \",V13,\" de bekendheid onder het publiek op een andere manier gemeten? Zo ja, hoe?\")","v":"De vragen 47 en 48 zijn indirecte indicatoren. Wordt bij  de bekendheid onder het publiek op een andere manier gemeten? Zo ja, hoe?"}]
[]
[null,null,"Opmerking:"]
[]
[]
[]
[]
[null,"Terugkoppeling en benchmark"]
[]
[null,null,{"$f":"CONCATENATE(\"Rijkswaterstaat wil de resultaten van de Monitor Circulaire Ambachtscentra graag terugkoppelen en ervoor zorgen dat ook \",V13,\" meer inzicht over de eigen en landelijke ontwikkelingen krijgt.\")","v":"Rijkswaterstaat wil de resultaten van de Monitor Circulaire Ambachtscentra graag terugkoppelen en ervoor zorgen dat ook  meer inzicht over de eigen en landelijke ontwikkelingen krijgt."}]
[]
[]
[null,{"$f":"B657+1","v":50},"Is er interesse in een benchmark/vergelijking met andere circulaire ambachtscentra?",null,null,null,null,null,null,null,null,null,null,null,null,null,null,null,null,null,null,null,null,null,null,null,null,null,null,null,null,null,null,null,null,null,null,null,null,null,null,null,null,null,{"$f":"IF(C672=\"\",0,1)","v":0}]
[]
[null,null,null,null,null,null,{"$f":"IF(C672=\"nee\",CONCATENATE(\"Ga door naar vraag \",B687),\"\")","v":""}]
[]
[null,{"$f":"B670+1","v":51},{"$f":"CONCATENATE(\"Op welke eigenschappen zou een vergelijking tussen \",V13,\" en andere circulaire ambachtscentra gewenst zijn?\")","v":"Op welke eigenschappen zou een vergelijking tussen  en andere circulaire ambachtscentra gewenst zijn?"},null,null,null,null,null,null,null,null,null,null,null,null,null,null,null,null,null,null,null,null,null,null,null,null,null,null,null,null,null,null,null,null,null,null,null,null,null,null,null,null,null,{"$f":"IF(AND(C672=\"ja\",COUNTIF(data!E229:K229,TRUE)>0),1,0)","v":0}]
[]
[null,null,"Type (netwerk of 1 locatie)"]
[null,null,"Ontwikkelstadium"]
[null,null,"Stedelijkheidsklasse"]
[null,null,"Provincie"]
[null,null,"Anders, namelijk"]
[null,null,"Anders, namelijk"]
[null,null,"Anders, namelijk"]
[]
[]
[null,"Aanvullende monitorgegevens"]
[]
[null,{"$f":"B674+1","v":52},{"$f":"CONCATENATE(\"Verzamelt \",V13,\" aanvullende kwantitatieve monitoringsgegevens?\")","v":"Verzamelt  aanvullende kwantitatieve monitoringsgegevens?"},null,null,null,null,null,null,null,null,null,null,null,null,null,null,null,null,null,null,null,null,null,null,null,null,null,null,null,null,null,null,null,null,null,null,null,null,null,null,null,null,null,{"$f":"IF(C693=\"\",0,1)","v":0}]
[null,null,"Denk aan:\n- hoeveelheden ingezameld, gerepareerd, hergebruikt of gerecycled per materiaal/ productgroepen\n- aantal werknemers, stageplekken, plekken voor dagbesteding, vrijwilligers, etc.\n- financiële kengetallen"]
[]
[]
[]
[]
[]
[]
[null,null,"Omdat alle circulaire ambachtscentra van elkaar verschillen, willen wij graag bestaande monitoringsgevens met elkaar vergelijken en analyseren. \nOns doel is om gestandaardiseerde kwantitatieve monitoringsvragen te stellen, die elk circulair ambachtscentrum kan beantwoorden."]
[]
[]
[null,{"$f":"B687+1","v":53},{"$f":"CONCATENATE(\"Is \",V13, \" bereid om deze gegevens met Rijkswaterstaat te delen?\")","v":"Is  bereid om deze gegevens met Rijkswaterstaat te delen?"},null,null,null,null,null,null,null,null,null,null,null,null,null,null,null,null,null,null,null,null,null,null,null,null,null,null,null,null,null,null,null,null,null,null,null,null,null,null,null,null,null,{"$f":"IF(C699=\"\",0,1)","v":0}]
[]
[]
[null,null,"In het upload formulier op www.circulairambachtscentrum.nl kunt u extra data uploaden."]
[]
[]
[null,"Mededelingen en feedback"]
[]
[null,{"$f":"B698+1","v":54},"Hieronder is nog ruimte om afsluitende mededelingen of feedback te plaatsen:",null,null,null,null,null,null,null,null,null,null,null,null,null,null,null,null,null,null,null,null,null,null,null,null,null,null,null,null,null,null,null,null,null,null,null,null,null,null,null,null,null,{"$f":"IF(C708<>\"\",1,0)","v":0}]
[]
[]
[]
[]
[]
[]
[]
[]
[]
[]
[]
[]
[]
[]
[null,null,"Check hier nog of je alle vragen hebt beantwoord, of dat er misschien ergens nog een antwoord of een vinkje mist."]
[]
[null,null,null,1,{"$f":"VLOOKUP(D723,'beantwoord - niet beantwoord'!$B$3:$C$50,2,FALSE)","v":0},null,null,{"$f":"D728+1","v":7},{"$f":"VLOOKUP(H723,'beantwoord - niet beantwoord'!$B$3:$C$50,2,FALSE)","v":0},null,null,{"$f":"H728+1","v":13},{"$f":"VLOOKUP(L723,'beantwoord - niet beantwoord'!$B$3:$C$50,2,FALSE)","v":0},null,null,{"$f":"L728+1","v":19},{"$f":"VLOOKUP(P723,'beantwoord - niet beantwoord'!$B$3:$C$50,2,FALSE)","v":0},null,null,{"$f":"P728+1","v":25},{"$f":"VLOOKUP(T723,'beantwoord - niet beantwoord'!$B$3:$C$50,2,FALSE)","v":0},null,null,{"$f":"T728+1","v":31},{"$f":"VLOOKUP(X723,'beantwoord - niet beantwoord'!$B$3:$C$50,2,FALSE)","v":0},null,null,{"$f":"X728+1","v":37},{"$f":"VLOOKUP(AB723,'beantwoord - niet beantwoord'!$B$3:$C$50,2,FALSE)","v":0},null,null,{"$f":"AB728+1","v":43},{"$f":"VLOOKUP(AF723,'beantwoord - niet beantwoord'!$B$3:$C$50,2,FALSE)","v":0},null,null,{"$f":"AF728+1","v":49},{"$f":"VLOOKUP(AJ723,'beantwoord - niet beantwoord'!$B$3:$C$56,2,FALSE)","v":0}]
[null,null,null,2,{"$f":"VLOOKUP(D724,'beantwoord - niet beantwoord'!$B$3:$C$50,2,FALSE)","v":0},null,null,{"$f":"H723+1","v":8},{"$f":"VLOOKUP(H724,'beantwoord - niet beantwoord'!$B$3:$C$50,2,FALSE)","v":0},null,null,{"$f":"L723+1","v":14},{"$f":"VLOOKUP(L724,'beantwoord - niet beantwoord'!$B$3:$C$50,2,FALSE)","v":0},null,null,{"$f":"P723+1","v":20},{"$f":"VLOOKUP(P724,'beantwoord - niet beantwoord'!$B$3:$C$50,2,FALSE)","v":0},null,null,{"$f":"T723+1","v":26},{"$f":"VLOOKUP(T724,'beantwoord - niet beantwoord'!$B$3:$C$50,2,FALSE)","v":0},null,null,{"$f":"X723+1","v":32},{"$f":"VLOOKUP(X724,'beantwoord - niet beantwoord'!$B$3:$C$50,2,FALSE)","v":"nvt"},null,null,{"$f":"AB723+1","v":38},{"$f":"VLOOKUP(AB724,'beantwoord - niet beantwoord'!$B$3:$C$50,2,FALSE)","v":0},null,null,{"$f":"AF723+1","v":44},{"$f":"VLOOKUP(AF724,'beantwoord - niet beantwoord'!$B$3:$C$50,2,FALSE)","v":0},null,null,{"$f":"AJ723+1","v":50},{"$f":"VLOOKUP(AJ724,'beantwoord - niet beantwoord'!$B$3:$C$56,2,FALSE)","v":0}]
[null,null,null,3,{"$f":"VLOOKUP(D725,'beantwoord - niet beantwoord'!$B$3:$C$50,2,FALSE)","v":0},null,null,{"$f":"H724+1","v":9},{"$f":"VLOOKUP(H725,'beantwoord - niet beantwoord'!$B$3:$C$50,2,FALSE)","v":0},null,null,{"$f":"L724+1","v":15},{"$f":"VLOOKUP(L725,'beantwoord - niet beantwoord'!$B$3:$C$50,2,FALSE)","v":0},null,null,{"$f":"P724+1","v":21},{"$f":"VLOOKUP(P725,'beantwoord - niet beantwoord'!$B$3:$C$50,2,FALSE)","v":0},null,null,{"$f":"T724+1","v":27},{"$f":"VLOOKUP(T725,'beantwoord - niet beantwoord'!$B$3:$C$50,2,FALSE)","v":0},null,null,{"$f":"X724+1","v":33},{"$f":"VLOOKUP(X725,'beantwoord - niet beantwoord'!$B$3:$C$50,2,FALSE)","v":0},null,null,{"$f":"AB724+1","v":39},{"$f":"VLOOKUP(AB725,'beantwoord - niet beantwoord'!$B$3:$C$50,2,FALSE)","v":0},null,null,{"$f":"AF724+1","v":45},{"$f":"VLOOKUP(AF725,'beantwoord - niet beantwoord'!$B$3:$C$50,2,FALSE)","v":0},null,null,{"$f":"AJ724+1","v":51},{"$f":"VLOOKUP(AJ725,'beantwoord - niet beantwoord'!$B$3:$C$56,2,FALSE)","v":0}]
[null,null,null,4,{"$f":"VLOOKUP(D726,'beantwoord - niet beantwoord'!$B$3:$C$50,2,FALSE)","v":0},null,null,10,{"$f":"VLOOKUP(H726,'beantwoord - niet beantwoord'!$B$3:$C$50,2,FALSE)","v":0},null,null,16,{"$f":"VLOOKUP(L726,'beantwoord - niet beantwoord'!$B$3:$C$50,2,FALSE)","v":{"$error":"#VALUE!"}},null,null,22,{"$f":"VLOOKUP(P726,'beantwoord - niet beantwoord'!$B$3:$C$50,2,FALSE)","v":0},null,null,28,{"$f":"VLOOKUP(T726,'beantwoord - niet beantwoord'!$B$3:$C$50,2,FALSE)","v":0},null,null,34,{"$f":"VLOOKUP(X726,'beantwoord - niet beantwoord'!$B$3:$C$50,2,FALSE)","v":{"$error":"#VALUE!"}},null,null,40,{"$f":"VLOOKUP(AB726,'beantwoord - niet beantwoord'!$B$3:$C$50,2,FALSE)","v":0},null,null,46,{"$f":"VLOOKUP(AF726,'beantwoord - niet beantwoord'!$B$3:$C$50,2,FALSE)","v":0},null,null,52,{"$f":"VLOOKUP(AJ726,'beantwoord - niet beantwoord'!$B$3:$C$56,2,FALSE)","v":0}]
[null,null,null,5,{"$f":"VLOOKUP(D727,'beantwoord - niet beantwoord'!$B$3:$C$50,2,FALSE)","v":0},null,null,11,{"$f":"VLOOKUP(H727,'beantwoord - niet beantwoord'!$B$3:$C$50,2,FALSE)","v":0},null,null,17,{"$f":"VLOOKUP(L727,'beantwoord - niet beantwoord'!$B$3:$C$50,2,FALSE)","v":0},null,null,23,{"$f":"VLOOKUP(P727,'beantwoord - niet beantwoord'!$B$3:$C$50,2,FALSE)","v":0},null,null,29,{"$f":"VLOOKUP(T727,'beantwoord - niet beantwoord'!$B$3:$C$50,2,FALSE)","v":0},null,null,35,{"$f":"VLOOKUP(X727,'beantwoord - niet beantwoord'!$B$3:$C$50,2,FALSE)","v":{"$error":"#VALUE!"}},null,null,41,{"$f":"VLOOKUP(AB727,'beantwoord - niet beantwoord'!$B$3:$C$50,2,FALSE)","v":0},null,null,47,{"$f":"VLOOKUP(AF727,'beantwoord - niet beantwoord'!$B$3:$C$50,2,FALSE)","v":0},null,null,53,{"$f":"VLOOKUP(AJ727,'beantwoord - niet beantwoord'!$B$3:$C$56,2,FALSE)","v":0}]
[null,null,null,6,{"$f":"VLOOKUP(D728,'beantwoord - niet beantwoord'!$B$3:$C$50,2,FALSE)","v":0},null,null,12,{"$f":"VLOOKUP(H728,'beantwoord - niet beantwoord'!$B$3:$C$50,2,FALSE)","v":0},null,null,18,{"$f":"VLOOKUP(L728,'beantwoord - niet beantwoord'!$B$3:$C$50,2,FALSE)","v":0},null,null,24,{"$f":"VLOOKUP(P728,'beantwoord - niet beantwoord'!$B$3:$C$50,2,FALSE)","v":0},null,null,30,{"$f":"VLOOKUP(T728,'beantwoord - niet beantwoord'!$B$3:$C$50,2,FALSE)","v":0},null,null,36,{"$f":"VLOOKUP(X728,'beantwoord - niet beantwoord'!$B$3:$C$50,2,FALSE)","v":0},null,null,42,{"$f":"VLOOKUP(AB728,'beantwoord - niet beantwoord'!$B$3:$C$50,2,FALSE)","v":0},null,null,48,{"$f":"VLOOKUP(AF728,'beantwoord - niet beantwoord'!$B$3:$C$50,2,FALSE)","v":0},null,null,54,{"$f":"VLOOKUP(AJ728,'beantwoord - niet beantwoord'!$B$3:$C$56,2,FALSE)","v":0}]
[]
[]
[]
[null,null,"Hartelijk dank voor uw medewerking!"]
[null,null,"Sla de ingevulde vragenlijst als Excel bestand op voor uw eigen adminstratie en upload een kopie op de website www.circulairambachtscentrum.nl (nog te bouwen)"]

{"sheet":"Partners","index":3,"n_rows":116,"n_cols":76,"rows_kept":116,"cut":false,"hidden":false,"merged":[[1,1,1,76],[47,2,47,9],[48,2,48,9],[45,2,45,9],[46,2,46,9],[42,2,42,9],[43,2,43,9],[44,2,44,9],[65,2,65,9],[66,2,66,9],[63,2,63,9],[64,2,64,9],[61,2,61,9],[62,2,62,9],[59,2,59,9],[60,2,60,9],[57,2,57,9],[58,2,58,9],[55,2,55,9],[56,2,56,9],[53,2,53,9],[54,2,54,9],[51,2,51,9],[52,2,52,9],[49,2,49,9],[50,2,50,9],[11,28,11,30],[11,31,11,33],[11,34,11,36],[11,37,11,39],[12,2,12,9],[12,10,12,12],[12,13,12,15],[12,16,12,18],[12,19,12,21],[12,22,12,24],[11,2,11,9],[11,10,11,12],[11,13,11,15],[11,16,11,18],[11,19,11,21],[11,22,11,24],[11,25,11,27],[12,25,12,27],[14,34,14,36],[14,37,14,39],[15,2,15,9],[15,10,15,12],[15,13,15,15],[15,16,15,18],[15,19,15,21],[14,2,14,9],[14,10,14,12],[14,13,14,15],[14,16,14,18],[14,19,14,21],[14,22,14,24],[12,31,12,33],[12,34,12,36],[12,37,12,39],[13,2,13,9],[13,10,13,12],[13,13,13,15],[13,16,13,18],[13,19,13,21],[13,22,13,24],[13,25,13,27],[13,28,13,30],[13,31,13,33],[13,34,13,36],[13,37,13,39],[12,28,12,30],[15,22,15,24],[15,25,15,27],[15,28,15,30],[15,31,15,33],[17,37,17,39],[16,25,16,27],[16,28,16,30],[16,31,16,33],[16,34,16,36],[16,37,16,39],[17,2,17,9],[17,10,17,12],[17,13,17,15],[17,16,17,18],[17,19,17,21],[16,2,16,9],[16,10,16,12],[16,13,16,15],[16,16,16,18],[16,19,16,21],[16,22,16,24],[15,34,15,36],[15,37,15,39],[14,25,14,27],[14,28,14,30],[14,31,14,33],[19,22,19,24],[19,25,19,27],[19,28,19,30],[19,31,19,33],[19,34,19,36],[19,37,19,39],[18,25,18,27],[18,28,18,30],[18,31,18,33],[18,34,18,36],[18,37,18,39],[19,2,19,9],[19,10,19,12],[19,13,19,15],[19,16,19,18],[19,19,19,21],[18,2,18,9],[18,10,18,12],[18,13,18,15],[18,16,18,18],[18,19,18,21],[18,22,18,24],[17,22,17,24],[17,25,17,27],[17,28,17,30],[17,31,17,33],[17,34,17,36],[21,22,21,24],[21,25,21,27],[21,28,21,30],[21,31,21,33],[21,34,21,36],[21,37,21,39],[20,25,20,27],[20,28,20,30],[20,31,20,33],[20,34,20,36],[20,37,20,39],[21,2,21,9],[21,10,21,12],[21,13,21,15],[21,16,21,18],[21,19,21,21],[20,2,20,9],[20,10,20,12],[20,13,20,15],[20,16,20,18],[20,19,20,21],[20,22,20,24],[23,22,23,24],[23,25,23,27],[23,28,23,30],[23,31,23,33],[23,34,23,36],[23,37,23,39],[22,25,22,27],[22,28,22,30],[22,31,22,33],[22,34,22,36],[22,37,22,39],[23,2,23,9],[23,10,23,12],[23,13,23,15],[23,16,23,18],[23,19,23,21],[22,2,22,9],[22,10,22,12],[22,13,22,15],[22,16,22,18],[22,19,22,21],[22,22,22,24],[25,22,25,24],[25,25,25,27],[25,28,25,30],[25,31,25,33],[25,34,25,36],[25,37,25,39],[24,25,24,27],[24,28,24,30],[24,31,24,33],[24,34,24,36],[24,37,24,39],[25,2,25,9],[25,10,25,12],[25,13,25,15],[25,16,25,18],[25,19,25,21],[24,2,24,9],[24,10,24,12],[24,13,24,15],[24,16,24,18],[24,19,24,21],[24,22,24,24],[27,22,27,24],[27,25,27,27],[27,28,27,30],[27,31,27,33],[27,34,27,36],[27,37,27,39],[26,25,26,27],[26,28,26,30],[26,31,26,33],[26,34,26,36],[26,37,26,39],[27,2,27,9],[27,10,27,12],[27,13,27,15],[27,16,27,18],[27,19,27,21],[26,2,26,9],[26,10,26,12],[26,13,26,15],[26,16,26,18],[26,19,26,21],[26,22,26,24],[29,22,29,24],[29,25,29,27],[29,28,29,30],[29,31,29,33],[29,34,29,36],[29,37,29,39],[28,25,28,27],[28,28,28,30],[28,31,28,33],[28,34,28,36],[28,37,28,39],[29,2,29,9],[29,10,29,12],[29,13,29,15],[29,16,29,18],[29,19,29,21],[28,2,28,9],[28,10,28,12],[28,13,28,15],[28,16,28,18],[28,19,28,21],[28,22,28,24],[31,22,31,24],[31,25,31,27],[31,28,31,30],[31,31,31,33],[31,34,31,36],[31,37,31,39],[30,25,30,27],[30,28,30,30],[30,31,30,33],[30,34,30,36],[30,37,30,39],[31,2,31,9],[31,10,31,12],[31,13,31,15],[31,16,31,18],[31,19,31,21],[30,2,30,9],[30,10,30,12],[30,13,30,15],[30,16,30,18],[30,19,30,21],[30,22,30,24],[33,22,33,24],[33,25,33,27],[33,28,33,30],[33,31,33,33],[33,34,33,36],[33,37,33,39],[32,25,32,27],[32,28,32,30],[32,31,32,33],[32,34,32,36],[32,37,32,39],[33,2,33,9],[33,10,33,12],[33,13,33,15],[33,16,33,18],[33,19,33,21],[32,2,32,9],[32,10,32,12],[32,13,32,15],[32,16,32,18],[32,19,32,21],[32,22,32,24],[35,22,35,24],[35,25,35,27],[35,28,35,30],[35,31,35,33],[35,34,35,36],[35,37,35,39],[34,25,34,27],[34,28,34,30],[34,31,34,33],[34,34,34,36],[34,37,34,39],[35,2,35,9],[35,10,35,12],[35,13,35,15],[35,16,35,18],[35,19,35,21],[34,2,34,9],[34,10,34,12],[34,13,34,15],[34,16,34,18],[34,19,34,21],[34,22,34,24],[37,22,37,24],[37,25,37,27],[37,28,37,30],[37,31,37,33],[37,34,37,36],[37,37,37,39],[36,25,36,27],[36,28,36,30],[36,31,36,33],[36,34,36,36],[36,37,36,39],[37,2,37,9],[37,10,37,12],[37,13,37,15],[37,16,37,18],[37,19,37,21],[36,2,36,9],[36,10,36,12],[36,13,36,15],[36,16,36,18],[36,19,36,21],[36,22,36,24],[39,22,39,24],[39,25,39,27],[39,28,39,30],[39,31,39,33],[39,34,39,36],[39,37,39,39],[38,25,38,27],[38,28,38,30],[38,31,38,33],[38,34,38,36],[38,37,38,39],[39,2,39,9],[39,10,39,12],[39,13,39,15],[39,16,39,18],[39,19,39,21],[38,2,38,9],[38,10,38,12],[38,13,38,15],[38,16,38,18],[38,19,38,21],[38,22,38,24],[41,22,41,24],[41,25,41,27],[41,28,41,30],[41,31,41,33],[41,34,41,36],[41,37,41,39],[40,25,40,27],[40,28,40,30],[40,31,40,33],[40,34,40,36],[40,37,40,39],[41,2,41,9],[41,10,41,12],[41,13,41,15],[41,16,41,18],[41,19,41,21],[40,2,40,9],[40,10,40,12],[40,13,40,15],[40,16,40,18],[40,19,40,21],[40,22,40,24],[43,31,43,33],[43,34,43,36],[43,37,43,39],[44,10,44,12],[44,13,44,15],[44,16,44,18],[44,19,44,21],[44,22,44,24],[44,25,44,27],[42,34,42,36],[42,37,42,39],[43,10,43,12],[43,13,43,15],[43,16,43,18],[43,19,43,21],[43,22,43,24],[43,25,43,27],[43,28,43,30],[42,10,42,12],[42,13,42,15],[42,16,42,18],[42,19,42,21],[42,22,42,24],[42,25,42,27],[42,28,42,30],[42,31,42,33],[46,22,46,24],[46,25,46,27],[46,28,46,30],[46,31,46,33],[46,34,46,36],[46,37,46,39],[45,25,45,27],[45,28,45,30],[45,31,45,33],[45,34,45,36],[45,37,45,39],[46,10,46,12],[46,13,46,15],[46,16,46,18],[46,19,46,21],[44,28,44,30],[44,31,44,33],[44,34,44,36],[44,37,44,39],[45,10,45,12],[45,13,45,15],[45,16,45,18],[45,19,45,21],[45,22,45,24],[48,22,48,24],[48,25,48,27],[48,28,48,30],[48,31,48,33],[48,34,48,36],[48,37,48,39],[47,25,47,27],[47,28,47,30],[47,31,47,33],[47,34,47,36],[47,37,47,39],[48,10,48,12],[48,13,48,15],[48,16,48,18],[48,19,48,21],[47,10,47,12],[47,13,47,15],[47,16,47,18],[47,19,47,21],[47,22,47,24],[50,22,50,24],[50,25,50,27],[50,28,50,30],[50,31,50,33],[50,34,50,36],[50,37,50,39],[49,25,49,27],[49,28,49,30],[49,31,49,33],[49,34,49,36],[49,37,49,39],[50,10,50,12],[50,13,50,15],[50,16,50,18],[50,19,50,21],[49,10,49,12],[49,13,49,15],[49,16,49,18],[49,19,49,21],[49,22,49,24],[52,22,52,24],[52,25,52,27],[52,28,52,30],[52,31,52,33],[52,34,52,36],[52,37,52,39],[51,25,51,27],[51,28,51,30],[51,31,51,33],[51,34,51,36],[51,37,51,39],[52,10,52,12],[52,13,52,15],[52,16,52,18],[52,19,52,21],[51,10,51,12],[51,13,51,15],[51,16,51,18],[51,19,51,21],[51,22,51,24],[54,22,54,24],[54,25,54,27],[54,28,54,30],[54,31,54,33],[54,34,54,36],[54,37,54,39],[53,25,53,27],[53,28,53,30],[53,31,53,33],[53,34,53,36],[53,37,53,39],[54,10,54,12],[54,13,54,15],[54,16,54,18],[54,19,54,21],[53,10,53,12],[53,13,53,15],[53,16,53,18],[53,19,53,21],[53,22,53,24],[56,22,56,24],[56,25,56,27],[56,28,56,30],[56,31,56,33],[56,34,56,36],[56,37,56,39],[55,25,55,27],[55,28,55,30],[55,31,55,33],[55,34,55,36],[55,37,55,39],[56,10,56,12],[56,13,56,15],[56,16,56,18],[56,19,56,21],[55,10,55,12],[55,13,55,15],[55,16,55,18],[55,19,55,21],[55,22,55,24],[58,22,58,24],[58,25,58,27],[58,28,58,30],[58,31,58,33],[58,34,58,36],[58,37,58,39],[57,25,57,27],[57,28,57,30],[57,31,57,33],[57,34,57,36],[57,37,57,39],[58,10,58,12],[58,13,58,15],[58,16,58,18],[58,19,58,21],[57,10,57,12],[57,13,57,15],[57,16,57,18],[57,19,57,21],[57,22,57,24],[60,22,60,24],[60,25,60,27],[60,28,60,30],[60,31,60,33],[60,34,60,36],[60,37,60,39],[59,25,59,27],[59,28,59,30],[59,31,59,33],[59,34,59,36],[59,37,59,39],[60,10,60,12],[60,13,60,15],[60,16,60,18],[60,19,60,21],[59,10,59,12],[59,13,59,15],[59,16,59,18],[59,19,59,21],[59,22,59,24],[62,22,62,24],[62,25,62,27],[62,28,62,30],[62,31,62,33],[62,34,62,36],[62,37,62,39],[61,25,61,27],[61,28,61,30],[61,31,61,33],[61,34,61,36],[61,37,61,39],[62,10,62,12],[62,13,62,15],[62,16,62,18],[62,19,62,21],[61,10,61,12],[61,13,61,15],[61,16,61,18],[61,19,61,21],[61,22,61,24],[64,22,64,24],[64,25,64,27],[64,28,64,30],[64,31,64,33],[64,34,64,36],[64,37,64,39],[63,25,63,27],[63,28,63,30],[63,31,63,33],[63,34,63,36],[63,37,63,39],[64,10,64,12],[64,13,64,15],[64,16,64,18],[64,19,64,21],[63,10,63,12],[63,13,63,15],[63,16,63,18],[63,19,63,21],[63,22,63,24],[66,22,66,24],[66,25,66,27],[66,28,66,30],[66,31,66,33],[66,34,66,36],[66,37,66,39],[65,25,65,27],[65,28,65,30],[65,31,65,33],[65,34,65,36],[65,37,65,39],[66,10,66,12],[66,13,66,15],[66,16,66,18],[66,19,66,21],[65,10,65,12],[65,13,65,15],[65,16,65,18],[65,19,65,21],[65,22,65,24],[68,22,68,24],[68,25,68,27],[68,28,68,30],[68,31,68,33],[68,34,68,36],[68,37,68,39],[67,25,67,27],[67,28,67,30],[67,31,67,33],[67,34,67,36],[67,37,67,39],[68,2,68,9],[68,10,68,12],[68,13,68,15],[68,16,68,18],[68,19,68,21],[67,2,67,9],[67,10,67,12],[67,13,67,15],[67,16,67,18],[67,19,67,21],[67,22,67,24],[70,22,70,24],[70,25,70,27],[70,28,70,30],[70,31,70,33],[70,34,70,36],[70,37,70,39],[69,25,69,27],[69,28,69,30],[69,31,69,33],[69,34,69,36],[69,37,69,39],[70,2,70,9],[70,10,70,12],[70,13,70,15],[70,16,70,18],[70,19,70,21],[69,2,69,9],[69,10,69,12],[69,13,69,15],[69,16,69,18],[69,19,69,21],[69,22,69,24],[72,22,72,24],[72,25,72,27],[72,28,72,30],[72,31,72,33],[72,34,72,36],[72,37,72,39],[71,25,71,27],[71,28,71,30],[71,31,71,33],[71,34,71,36],[71,37,71,39],[72,2,72,9],[72,10,72,12],[72,13,72,15],[72,16,72,18],[72,19,72,21],[71,2,71,9],[71,10,71,12],[71,13,71,15],[71,16,71,18],[71,19,71,21],[71,22,71,24],[74,22,74,24],[74,25,74,27],[74,28,74,30],[74,31,74,33],[74,34,74,36],[74,37,74,39],[73,25,73,27],[73,28,73,30],[73,31,73,33],[73,34,73,36],[73,37,73,39],[74,2,74,9],[74,10,74,12],[74,13,74,15],[74,16,74,18],[74,19,74,21],[73,2,73,9],[73,10,73,12],[73,13,73,15],[73,16,73,18],[73,19,73,21],[73,22,73,24],[76,22,76,24],[76,25,76,27],[76,28,76,30],[76,31,76,33],[76,34,76,36],[76,37,76,39],[75,25,75,27],[75,28,75,30],[75,31,75,33],[75,34,75,36],[75,37,75,39],[76,2,76,9],[76,10,76,12],[76,13,76,15],[76,16,76,18],[76,19,76,21],[75,2,75,9],[75,10,75,12],[75,13,75,15],[75,16,75,18],[75,19,75,21],[75,22,75,24],[78,22,78,24],[78,25,78,27],[78,28,78,30],[78,31,78,33],[78,34,78,36],[78,37,78,39],[77,25,77,27],[77,28,77,30],[77,31,77,33],[77,34,77,36],[77,37,77,39],[78,2,78,9],[78,10,78,12],[78,13,78,15],[78,16,78,18],[78,19,78,21],[77,2,77,9],[77,10,77,12],[77,13,77,15],[77,16,77,18],[77,19,77,21],[77,22,77,24],[80,22,80,24],[80,25,80,27],[80,28,80,30],[80,31,80,33],[80,34,80,36],[80,37,80,39],[79,25,79,27],[79,28,79,30],[79,31,79,33],[79,34,79,36],[79,37,79,39],[80,2,80,9],[80,10,80,12],[80,13,80,15],[80,16,80,18],[80,19,80,21],[79,2,79,9],[79,10,79,12],[79,13,79,15],[79,16,79,18],[79,19,79,21],[79,22,79,24],[82,22,82,24],[82,25,82,27],[82,28,82,30],[82,31,82,33],[82,34,82,36],[82,37,82,39],[81,25,81,27],[81,28,81,30],[81,31,81,33],[81,34,81,36],[81,37,81,39],[82,2,82,9],[82,10,82,12],[82,13,82,15],[82,16,82,18],[82,19,82,21],[81,2,81,9],[81,10,81,12],[81,13,81,15],[81,16,81,18],[81,19,81,21],[81,22,81,24],[84,22,84,24],[84,25,84,27],[84,28,84,30],[84,31,84,33],[84,34,84,36],[84,37,84,39],[83,25,83,27],[83,28,83,30],[83,31,83,33],[83,34,83,36],[83,37,83,39],[84,2,84,9],[84,10,84,12],[84,13,84,15],[84,16,84,18],[84,19,84,21],[83,2,83,9],[83,10,83,12],[83,13,83,15],[83,16,83,18],[83,19,83,21],[83,22,83,24],[86,22,86,24],[86,25,86,27],[86,28,86,30],[86,31,86,33],[86,34,86,36],[86,37,86,39],[85,25,85,27],[85,28,85,30],[85,31,85,33],[85,34,85,36],[85,37,85,39],[86,2,86,9],[86,10,86,12],[86,13,86,15],[86,16,86,18],[86,19,86,21],[85,2,85,9],[85,10,85,12],[85,13,85,15],[85,16,85,18],[85,19,85,21],[85,22,85,24],[88,22,88,24],[88,25,88,27],[88,28,88,30],[88,31,88,33],[88,34,88,36],[88,37,88,39],[87,25,87,27],[87,28,87,30],[87,31,87,33],[87,34,87,36],[87,37,87,39],[88,2,88,9],[88,10,88,12],[88,13,88,15],[88,16,88,18],[88,19,88,21],[87,2,87,9],[87,10,87,12],[87,13,87,15],[87,16,87,18],[87,19,87,21],[87,22,87,24],[90,22,90,24],[90,25,90,27],[90,28,90,30],[90,31,90,33],[90,34,90,36],[90,37,90,39],[89,25,89,27],[89,28,89,30],[89,31,89,33],[89,34,89,36],[89,37,89,39],[90,2,90,9],[90,10,90,12],[90,13,90,15],[90,16,90,18],[90,19,90,21],[89,2,89,9],[89,10,89,12],[89,13,89,15],[89,16,89,18],[89,19,89,21],[89,22,89,24],[92,22,92,24],[92,25,92,27],[92,28,92,30],[92,31,92,33],[92,34,92,36],[92,37,92,39],[91,25,91,27],[91,28,91,30],[91,31,91,33],[91,34,91,36],[91,37,91,39],[92,2,92,9],[92,10,92,12],[92,13,92,15],[92,16,92,18],[92,19,92,21],[91,2,91,9],[91,10,91,12],[91,13,91,15],[91,16,91,18],[91,19,91,21],[91,22,91,24],[94,22,94,24],[94,25,94,27],[94,28,94,30],[94,31,94,33],[94,34,94,36],[94,37,94,39],[93,25,93,27],[93,28,93,30],[93,31,93,33],[93,34,93,36],[93,37,93,39],[94,2,94,9],[94,10,94,12],[94,13,94,15],[94,16,94,18],[94,19,94,21],[93,2,93,9],[93,10,93,12],[93,13,93,15],[93,16,93,18],[93,19,93,21],[93,22,93,24],[96,22,96,24],[96,25,96,27],[96,28,96,30],[96,31,96,33],[96,34,96,36],[96,37,96,39],[95,25,95,27],[95,28,95,30],[95,31,95,33],[95,34,95,36],[95,37,95,39],[96,2,96,9],[96,10,96,12],[96,13,96,15],[96,16,96,18],[96,19,96,21],[95,2,95,9],[95,10,95,12],[95,13,95,15],[95,16,95,18],[95,19,95,21],[95,22,95,24],[98,22,98,24],[98,25,98,27],[98,28,98,30],[98,31,98,33],[98,34,98,36],[98,37,98,39],[97,25,97,27],[97,28,97,30],[97,31,97,33],[97,34,97,36],[97,37,97,39],[98,2,98,9],[98,10,98,12],[98,13,98,15],[98,16,98,18],[98,19,98,21],[97,2,97,9],[97,10,97,12],[97,13,97,15],[97,16,97,18],[97,19,97,21],[97,22,97,24],[100,22,100,24],[100,25,100,27],[100,28,100,30],[100,31,100,33],[100,34,100,36],[100,37,100,39],[99,25,99,27],[99,28,99,30],[99,31,99,33],[99,34,99,36],[99,37,99,39],[100,2,100,9],[100,10,100,12],[100,13,100,15],[100,16,100,18],[100,19,100,21],[99,2,99,9],[99,10,99,12],[99,13,99,15],[99,16,99,18],[99,19,99,21],[99,22,99,24],[102,22,102,24],[102,25,102,27],[102,28,102,30],[102,31,102,33],[102,34,102,36],[102,37,102,39],[101,25,101,27],[101,28,101,30],[101,31,101,33]],"merged_total":2151,"flags":["merged_cut"]}
[]
[null,"Aangesloten organisaties"]
[null,{"$f":"Vragenlijst!B73","v":8},{"$f":"Vragenlijst!C73","v":"Welke partners van  zijn aangesloten op 31.12.2025?"},null,null,null,null,null,null,null,null,null,null,null,null,null,null,null,null,null,null,null,null,null,null,null,null,null,null,null,null,null,null,null,null,null,null,null,null,null,null,null,null,{"$f":"Vragenlijst!B120","v":9},{"$f":"Vragenlijst!C120","v":"Zijn er partners die ook bij een andere bouwsteen passen? Zo ja, welke?"}]
[]
[null,null,{"$f":"Vragenlijst!C74","v":"Geef aan bij welke primaire bouwsteen zij horen.\nEen partner van een circulair ambachtscentrum voert een ambacht uit en/of faciliteert levensduurverlinging van materialen of producten. Bij kringlooporganisaties en milieustraten dienen alle vestigingen aangegeven te worden."},null,null,null,null,null,null,null,null,null,null,null,null,null,null,null,null,null,null,null,null,null,null,null,null,null,null,null,null,null,null,null,null,null,null,null,null,null,null,null,null,null,{"$f":"Vragenlijst!C121","v":"Geef aan bij welke secundaire bouwsteen zij horen."}]
[null,null,{"$f":"Vragenlijst!C75","v":"Geef hieronder (links) de naam van de organisatie aan en de primaire bouwsteen die het vervult. Een mogelijke secundaire bouwsteen van een partner kan in vraag 9 aangegeven worden."},null,null,null,null,null,null,null,null,null,null,null,null,null,null,null,null,null,null,null,null,null,null,null,null,null,null,null,null,null,null,null,null,null,null,null,null,null,null,null,null,null,"Bijvoorbeeld een sociaal-maatschappelijke instelling die vooral reparatie-activiteiten uitvoert binnen het circulaire ambachtscentrum."]
[]
[null,null,{"$f":"Vragenlijst!C77","v":"Let op: een keuzerondje kan niet gedeselecteerd worden, gebruik dan de optie \"n.v.t.\"."}]
[]
[null,null,null,null,null,null,null,null,null,null,"Primaire bouwstenen",null,null,null,null,null,null,null,null,null,null,null,null,null,null,null,null,null,null,null,null,null,null,null,null,null,null,null,null,null,null,null,null,null,"Secundaire bouwstenen"]
[]
[null,null,"Naam partner",null,null,null,null,null,null,null,"Milieustraat ",null,null,"Kringloop-winkel",null,null,"Repair Café/\nReparatie-werkplaats",null,null,"Sociale partners",null,null,"Onderwijs-instelling",null,null,"Werkplaats en/of makers-plaats",null,null,"Initiatieven voor de deel-economie",null,null,"Ondernemers die hergebruiken of repareren",null,null,"Demontage",null,null,"Alternatief element",null,null,null,"n.v.t.",null,null,"Milieustraat ",null,null,"Kringloop-winkel",null,null,"Repair Café/\nReparatie-werkplaats",null,null,"Sociale partners",null,null,"Onderwijs-instelling",null,null,"Werkplaats en/of makers-plaats",null,null,"Initiatieven voor de deel-economie",null,null,"Ondernemers die hergebruiken of repareren",null,null,"Demontage",null,null,"Alternatief element",null,null,null,"n.v.t."]
[null,1,{"$f":"IF(Vragenlijst!C82=\"\",\"\",Vragenlijst!C82)","v":""},null,null,null,null,null,null,null,null,null,null,null,null,null,null,null,null,null,null,null,null,null,null,null,null,null,null,null,null,null,null,null,null,null,null,null,null,null,null,null,null,1]
[null,{"$f":"B13+1","v":2},{"$f":"IF(Vragenlijst!C83=\"\",\"\",Vragenlijst!C83)","v":""},null,null,null,null,null,null,null,null,null,null,null,null,null,null,null,null,null,null,null,null,null,null,null,null,null,null,null,null,null,null,null,null,null,null,null,null,null,null,null,null,{"$f":"AR13+1","v":2}]
[null,{"$f":"B14+1","v":3},{"$f":"IF(Vragenlijst!C84=\"\",\"\",Vragenlijst!C84)","v":""},null,null,null,null,null,null,null,null,null,null,null,null,null,null,null,null,null,null,null,null,null,null,null,null,null,null,null,null,null,null,null,null,null,null,null,null,null,null,null,null,{"$f":"AR14+1","v":3}]
[null,4,{"$f":"IF(Vragenlijst!C85=\"\",\"\",Vragenlijst!C85)","v":""},null,null,null,null,null,null,null,null,null,null,null,null,null,null,null,null,null,null,null,null,null,null,null,null,null,null,null,null,null,null,null,null,null,null,null,null,null,null,null,null,4]
[null,5,{"$f":"IF(Vragenlijst!C86=\"\",\"\",Vragenlijst!C86)","v":""},null,null,null,null,null,null,null,null,null,null,null,null,null,null,null,null,null,null,null,null,null,null,null,null,null,null,null,null,null,null,null,null,null,null,null,null,null,null,null,null,5]
[null,6,{"$f":"IF(Vragenlijst!C87=\"\",\"\",Vragenlijst!C87)","v":""},null,null,null,null,null,null,null,null,null,null,null,null,null,null,null,null,null,null,null,null,null,null,null,null,null,null,null,null,null,null,null,null,null,null,null,null,null,null,null,null,6]
[null,7,{"$f":"IF(Vragenlijst!C88=\"\",\"\",Vragenlijst!C88)","v":""},null,null,null,null,null,null,null,null,null,null,null,null,null,null,null,null,null,null,null,null,null,null,null,null,null,null,null,null,null,null,null,null,null,null,null,null,null,null,null,null,7]
[null,8,{"$f":"IF(Vragenlijst!C89=\"\",\"\",Vragenlijst!C89)","v":""},null,null,null,null,null,null,null,null,null,null,null,null,null,null,null,null,null,null,null,null,null,null,null,null,null,null,null,null,null,null,null,null,null,null,null,null,null,null,null,null,8]
[null,9,{"$f":"IF(Vragenlijst!C90=\"\",\"\",Vragenlijst!C90)","v":""},null,null,null,null,null,null,null,null,null,null,null,null,null,null,null,null,null,null,null,null,null,null,null,null,null,null,null,null,null,null,null,null,null,null,null,null,null,null,null,null,9]
[null,10,{"$f":"IF(Vragenlijst!C91=\"\",\"\",Vragenlijst!C91)","v":""},null,null,null,null,null,null,null,null,null,null,null,null,null,null,null,null,null,null,null,null,null,null,null,null,null,null,null,null,null,null,null,null,null,null,null,null,null,null,null,null,10]
[null,11,{"$f":"IF(Vragenlijst!C92=\"\",\"\",Vragenlijst!C92)","v":""},null,null,null,null,null,null,null,null,null,null,null,null,null,null,null,null,null,null,null,null,null,null,null,null,null,null,null,null,null,null,null,null,null,null,null,null,null,null,null,null,11]
[null,12,{"$f":"IF(Vragenlijst!C93=\"\",\"\",Vragenlijst!C93)","v":""},null,null,null,null,null,null,null,null,null,null,null,null,null,null,null,null,null,null,null,null,null,null,null,null,null,null,null,null,null,null,null,null,null,null,null,null,null,null,null,null,12]
[null,13,{"$f":"IF(Vragenlijst!C94=\"\",\"\",Vragenlijst!C94)","v":""},null,null,null,null,null,null,null,null,null,null,null,null,null,null,null,null,null,null,null,null,null,null,null,null,null,null,null,null,null,null,null,null,null,null,null,null,null,null,null,null,13]
[null,14,{"$f":"IF(Vragenlijst!C95=\"\",\"\",Vragenlijst!C95)","v":""},null,null,null,null,null,null,null,null,null,null,null,null,null,null,null,null,null,null,null,null,null,null,null,null,null,null,null,null,null,null,null,null,null,null,null,null,null,null,null,null,14]
[null,15,{"$f":"IF(Vragenlijst!C96=\"\",\"\",Vragenlijst!C96)","v":""},null,null,null,null,null,null,null,null,null,null,null,null,null,null,null,null,null,null,null,null,null,null,null,null,null,null,null,null,null,null,null,null,null,null,null,null,null,null,null,null,15]
[null,16,{"$f":"IF(Vragenlijst!C97=\"\",\"\",Vragenlijst!C97)","v":""},null,null,null,null,null,null,null,null,null,null,null,null,null,null,null,null,null,null,null,null,null,null,null,null,null,null,null,null,null,null,null,null,null,null,null,null,null,null,null,null,16]
[null,17,{"$f":"IF(Vragenlijst!C98=\"\",\"\",Vragenlijst!C98)","v":""},null,null,null,null,null,null,null,null,null,null,null,null,null,null,null,null,null,null,null,null,null,null,null,null,null,null,null,null,null,null,null,null,null,null,null,null,null,null,null,null,17]
[null,18,{"$f":"IF(Vragenlijst!C99=\"\",\"\",Vragenlijst!C99)","v":""},null,null,null,null,null,null,null,null,null,null,null,null,null,null,null,null,null,null,null,null,null,null,null,null,null,null,null,null,null,null,null,null,null,null,null,null,null,null,null,null,18]
[null,19,{"$f":"IF(Vragenlijst!C100=\"\",\"\",Vragenlijst!C100)","v":""},null,null,null,null,null,null,null,null,null,null,null,null,null,null,null,null,null,null,null,null,null,null,null,null,null,null,null,null,null,null,null,null,null,null,null,null,null,null,null,null,19]
[null,20,{"$f":"IF(Vragenlijst!C101=\"\",\"\",Vragenlijst!C101)","v":""},null,null,null,null,null,null,null,null,null,null,null,null,null,null,null,null,null,null,null,null,null,null,null,null,null,null,null,null,null,null,null,null,null,null,null,null,null,null,null,null,20]
[null,21,{"$f":"IF(Vragenlijst!C102=\"\",\"\",Vragenlijst!C102)","v":""},null,null,null,null,null,null,null,null,null,null,null,null,null,null,null,null,null,null,null,null,null,null,null,null,null,null,null,null,null,null,null,null,null,null,null,null,null,null,null,null,21]
[null,22,{"$f":"IF(Vragenlijst!C103=\"\",\"\",Vragenlijst!C103)","v":""},null,null,null,null,null,null,null,null,null,null,null,null,null,null,null,null,null,null,null,null,null,null,null,null,null,null,null,null,null,null,null,null,null,null,null,null,null,null,null,null,22]
[null,23,{"$f":"IF(Vragenlijst!C104=\"\",\"\",Vragenlijst!C104)","v":""},null,null,null,null,null,null,null,null,null,null,null,null,null,null,null,null,null,null,null,null,null,null,null,null,null,null,null,null,null,null,null,null,null,null,null,null,null,null,null,null,23]
[null,24,{"$f":"IF(Vragenlijst!C105=\"\",\"\",Vragenlijst!C105)","v":""},null,null,null,null,null,null,null,null,null,null,null,null,null,null,null,null,null,null,null,null,null,null,null,null,null,null,null,null,null,null,null,null,null,null,null,null,null,null,null,null,24]
[null,25,{"$f":"IF(Vragenlijst!C106=\"\",\"\",Vragenlijst!C106)","v":""},null,null,null,null,null,null,null,null,null,null,null,null,null,null,null,null,null,null,null,null,null,null,null,null,null,null,null,null,null,null,null,null,null,null,null,null,null,null,null,null,25]
[null,26,{"$f":"IF(Vragenlijst!C107=\"\",\"\",Vragenlijst!C107)","v":""},null,null,null,null,null,null,null,null,null,null,null,null,null,null,null,null,null,null,null,null,null,null,null,null,null,null,null,null,null,null,null,null,null,null,null,null,null,null,null,null,26]
[null,27,{"$f":"IF(Vragenlijst!C108=\"\",\"\",Vragenlijst!C108)","v":""},null,null,null,null,null,null,null,null,null,null,null,null,null,null,null,null,null,null,null,null,null,null,null,null,null,null,null,null,null,null,null,null,null,null,null,null,null,null,null,null,27]
[null,28,{"$f":"IF(Vragenlijst!C109=\"\",\"\",Vragenlijst!C109)","v":""},null,null,null,null,null,null,null,null,null,null,null,null,null,null,null,null,null,null,null,null,null,null,null,null,null,null,null,null,null,null,null,null,null,null,null,null,null,null,null,null,28]
[null,29,{"$f":"IF(Vragenlijst!C110=\"\",\"\",Vragenlijst!C110)","v":""},null,null,null,null,null,null,null,null,null,null,null,null,null,null,null,null,null,null,null,null,null,null,null,null,null,null,null,null,null,null,null,null,null,null,null,null,null,null,null,null,29]
[null,30,{"$f":"IF(Vragenlijst!C111=\"\",\"\",Vragenlijst!C111)","v":""},null,null,null,null,null,null,null,null,null,null,null,null,null,null,null,null,null,null,null,null,null,null,null,null,null,null,null,null,null,null,null,null,null,null,null,null,null,null,null,null,30]
[null,{"$f":"B42+1","v":31},null,null,null,null,null,null,null,null,null,null,null,null,null,null,null,null,null,null,null,null,null,null,null,null,null,null,null,null,null,null,null,null,null,null,null,null,null,null,null,null,null,{"$f":"AR42+1","v":31}]
[null,32,null,null,null,null,null,null,null,null,null,null,null,null,null,null,null,null,null,null,null,null,null,null,null,null,null,null,null,null,null,null,null,null,null,null,null,null,null,null,null,null,null,32]
[null,33,null,null,null,null,null,null,null,null,null,null,null,null,null,null,null,null,null,null,null,null,null,null,null,null,null,null,null,null,null,null,null,null,null,null,null,null,null,null,null,null,null,33]
[null,34,null,null,null,null,null,null,null,null,null,null,null,null,null,null,null,null,null,null,null,null,null,null,null,null,null,null,null,null,null,null,null,null,null,null,null,null,null,null,null,null,null,34]
[null,35,null,null,null,null,null,null,null,null,null,null,null,null,null,null,null,null,null,null,null,null,null,null,null,null,null,null,null,null,null,null,null,null,null,null,null,null,null,null,null,null,null,35]
[null,36,null,null,null,null,null,null,null,null,null,null,null,null,null,null,null,null,null,null,null,null,null,null,null,null,null,null,null,null,null,null,null,null,null,null,null,null,null,null,null,null,null,36]
[null,37,null,null,null,null,null,null,null,null,null,null,null,null,null,null,null,null,null,null,null,null,null,null,null,null,null,null,null,null,null,null,null,null,null,null,null,null,null,null,null,null,null,37]
[null,38,null,null,null,null,null,null,null,null,null,null,null,null,null,null,null,null,null,null,null,null,null,null,null,null,null,null,null,null,null,null,null,null,null,null,null,null,null,null,null,null,null,38]
[null,39,null,null,null,null,null,null,null,null,null,null,null,null,null,null,null,null,null,null,null,null,null,null,null,null,null,null,null,null,null,null,null,null,null,null,null,null,null,null,null,null,null,39]
[null,40,null,null,null,null,null,null,null,null,null,null,null,null,null,null,null,null,null,null,null,null,null,null,null,null,null,null,null,null,null,null,null,null,null,null,null,null,null,null,null,null,null,40]
[null,41,null,null,null,null,null,null,null,null,null,null,null,null,null,null,null,null,null,null,null,null,null,null,null,null,null,null,null,null,null,null,null,null,null,null,null,null,null,null,null,null,null,41]
[null,42,null,null,null,null,null,null,null,null,null,null,null,null,null,null,null,null,null,null,null,null,null,null,null,null,null,null,null,null,null,null,null,null,null,null,null,null,null,null,null,null,null,42]
[null,43,null,null,null,null,null,null,null,null,null,null,null,null,null,null,null,null,null,null,null,null,null,null,null,null,null,null,null,null,null,null,null,null,null,null,null,null,null,null,null,null,null,43]
[null,44,null,null,null,null,null,null,null,null,null,null,null,null,null,null,null,null,null,null,null,null,null,null,null,null,null,null,null,null,null,null,null,null,null,null,null,null,null,null,null,null,null,44]
[null,45,null,null,null,null,null,null,null,null,null,null,null,null,null,null,null,null,null,null,null,null,null,null,null,null,null,null,null,null,null,null,null,null,null,null,null,null,null,null,null,null,null,45]
[null,46,null,null,null,null,null,null,null,null,null,null,null,null,null,null,null,null,null,null,null,null,null,null,null,null,null,null,null,null,null,null,null,null,null,null,null,null,null,null,null,null,null,46]
[null,47,null,null,null,null,null,null,null,null,null,null,null,null,null,null,null,null,null,null,null,null,null,null,null,null,null,null,null,null,null,null,null,null,null,null,null,null,null,null,null,null,null,47]
[null,48,null,null,null,null,null,null,null,null,null,null,null,null,null,null,null,null,null,null,null,null,null,null,null,null,null,null,null,null,null,null,null,null,null,null,null,null,null,null,null,null,null,48]
[null,49,null,null,null,null,null,null,null,null,null,null,null,null,null,null,null,null,null,null,null,null,null,null,null,null,null,null,null,null,null,null,null,null,null,null,null,null,null,null,null,null,null,49]
[null,50,null,null,null,null,null,null,null,null,null,null,null,null,null,null,null,null,null,null,null,null,null,null,null,null,null,null,null,null,null,null,null,null,null,null,null,null,null,null,null,null,null,50]
[null,51,null,null,null,null,null,null,null,null,null,null,null,null,null,null,null,null,null,null,null,null,null,null,null,null,null,null,null,null,null,null,null,null,null,null,null,null,null,null,null,null,null,51]
[null,52,null,null,null,null,null,null,null,null,null,null,null,null,null,null,null,null,null,null,null,null,null,null,null,null,null,null,null,null,null,null,null,null,null,null,null,null,null,null,null,null,null,52]
[null,53,null,null,null,null,null,null,null,null,null,null,null,null,null,null,null,null,null,null,null,null,null,null,null,null,null,null,null,null,null,null,null,null,null,null,null,null,null,null,null,null,null,53]
[null,54,null,null,null,null,null,null,null,null,null,null,null,null,null,null,null,null,null,null,null,null,null,null,null,null,null,null,null,null,null,null,null,null,null,null,null,null,null,null,null,null,null,54]
[null,55,null,null,null,null,null,null,null,null,null,null,null,null,null,null,null,null,null,null,null,null,null,null,null,null,null,null,null,null,null,null,null,null,null,null,null,null,null,null,null,null,null,55]
[null,56,null,null,null,null,null,null,null,null,null,null,null,null,null,null,null,null,null,null,null,null,null,null,null,null,null,null,null,null,null,null,null,null,null,null,null,null,null,null,null,null,null,56]
[null,57,null,null,null,null,null,null,null,null,null,null,null,null,null,null,null,null,null,null,null,null,null,null,null,null,null,null,null,null,null,null,null,null,null,null,null,null,null,null,null,null,null,57]
[null,58,null,null,null,null,null,null,null,null,null,null,null,null,null,null,null,null,null,null,null,null,null,null,null,null,null,null,null,null,null,null,null,null,null,null,null,null,null,null,null,null,null,58]
[null,59,null,null,null,null,null,null,null,null,null,null,null,null,null,null,null,null,null,null,null,null,null,null,null,null,null,null,null,null,null,null,null,null,null,null,null,null,null,null,null,null,null,59]
[null,60,null,null,null,null,null,null,null,null,null,null,null,null,null,null,null,null,null,null,null,null,null,null,null,null,null,null,null,null,null,null,null,null,null,null,null,null,null,null,null,null,null,60]
[null,61,null,null,null,null,null,null,null,null,null,null,null,null,null,null,null,null,null,null,null,null,null,null,null,null,null,null,null,null,null,null,null,null,null,null,null,null,null,null,null,null,null,61]
[null,62,null,null,null,null,null,null,null,null,null,null,null,null,null,null,null,null,null,null,null,null,null,null,null,null,null,null,null,null,null,null,null,null,null,null,null,null,null,null,null,null,null,62]
[null,63,null,null,null,null,null,null,null,null,null,null,null,null,null,null,null,null,null,null,null,null,null,null,null,null,null,null,null,null,null,null,null,null,null,null,null,null,null,null,null,null,null,63]
[null,64,null,null,null,null,null,null,null,null,null,null,null,null,null,null,null,null,null,null,null,null,null,null,null,null,null,null,null,null,null,null,null,null,null,null,null,null,null,null,null,null,null,64]
[null,65,null,null,null,null,null,null,null,null,null,null,null,null,null,null,null,null,null,null,null,null,null,null,null,null,null,null,null,null,null,null,null,null,null,null,null,null,null,null,null,null,null,65]
[null,66,null,null,null,null,null,null,null,null,null,null,null,null,null,null,null,null,null,null,null,null,null,null,null,null,null,null,null,null,null,null,null,null,null,null,null,null,null,null,null,null,null,66]
[null,67,null,null,null,null,null,null,null,null,null,null,null,null,null,null,null,null,null,null,null,null,null,null,null,null,null,null,null,null,null,null,null,null,null,null,null,null,null,null,null,null,null,{"$f":"AR78+1","v":67}]
[null,68,null,null,null,null,null,null,null,null,null,null,null,null,null,null,null,null,null,null,null,null,null,null,null,null,null,null,null,null,null,null,null,null,null,null,null,null,null,null,null,null,null,68]
[null,69,null,null,null,null,null,null,null,null,null,null,null,null,null,null,null,null,null,null,null,null,null,null,null,null,null,null,null,null,null,null,null,null,null,null,null,null,null,null,null,null,null,69]
[null,70,null,null,null,null,null,null,null,null,null,null,null,null,null,null,null,null,null,null,null,null,null,null,null,null,null,null,null,null,null,null,null,null,null,null,null,null,null,null,null,null,null,70]
[null,71,null,null,null,null,null,null,null,null,null,null,null,null,null,null,null,null,null,null,null,null,null,null,null,null,null,null,null,null,null,null,null,null,null,null,null,null,null,null,null,null,null,71]
[null,72,null,null,null,null,null,null,null,null,null,null,null,null,null,null,null,null,null,null,null,null,null,null,null,null,null,null,null,null,null,null,null,null,null,null,null,null,null,null,null,null,null,72]
[null,73,null,null,null,null,null,null,null,null,null,null,null,null,null,null,null,null,null,null,null,null,null,null,null,null,null,null,null,null,null,null,null,null,null,null,null,null,null,null,null,null,null,73]
[null,74,null,null,null,null,null,null,null,null,null,null,null,null,null,null,null,null,null,null,null,null,null,null,null,null,null,null,null,null,null,null,null,null,null,null,null,null,null,null,null,null,null,74]
[null,75,null,null,null,null,null,null,null,null,null,null,null,null,null,null,null,null,null,null,null,null,null,null,null,null,null,null,null,null,null,null,null,null,null,null,null,null,null,null,null,null,null,75]
[null,76,null,null,null,null,null,null,null,null,null,null,null,null,null,null,null,null,null,null,null,null,null,null,null,null,null,null,null,null,null,null,null,null,null,null,null,null,null,null,null,null,null,76]
[null,77,null,null,null,null,null,null,null,null,null,null,null,null,null,null,null,null,null,null,null,null,null,null,null,null,null,null,null,null,null,null,null,null,null,null,null,null,null,null,null,null,null,77]
[null,78,null,null,null,null,null,null,null,null,null,null,null,null,null,null,null,null,null,null,null,null,null,null,null,null,null,null,null,null,null,null,null,null,null,null,null,null,null,null,null,null,null,78]
[null,79,null,null,null,null,null,null,null,null,null,null,null,null,null,null,null,null,null,null,null,null,null,null,null,null,null,null,null,null,null,null,null,null,null,null,null,null,null,null,null,null,null,79]
[null,80,null,null,null,null,null,null,null,null,null,null,null,null,null,null,null,null,null,null,null,null,null,null,null,null,null,null,null,null,null,null,null,null,null,null,null,null,null,null,null,null,null,80]
[null,81,null,null,null,null,null,null,null,null,null,null,null,null,null,null,null,null,null,null,null,null,null,null,null,null,null,null,null,null,null,null,null,null,null,null,null,null,null,null,null,null,null,81]
[null,82,null,null,null,null,null,null,null,null,null,null,null,null,null,null,null,null,null,null,null,null,null,null,null,null,null,null,null,null,null,null,null,null,null,null,null,null,null,null,null,null,null,82]
[null,83,null,null,null,null,null,null,null,null,null,null,null,null,null,null,null,null,null,null,null,null,null,null,null,null,null,null,null,null,null,null,null,null,null,null,null,null,null,null,null,null,null,83]
[null,84,null,null,null,null,null,null,null,null,null,null,null,null,null,null,null,null,null,null,null,null,null,null,null,null,null,null,null,null,null,null,null,null,null,null,null,null,null,null,null,null,null,84]
[null,85,null,null,null,null,null,null,null,null,null,null,null,null,null,null,null,null,null,null,null,null,null,null,null,null,null,null,null,null,null,null,null,null,null,null,null,null,null,null,null,null,null,85]
[null,86,null,null,null,null,null,null,null,null,null,null,null,null,null,null,null,null,null,null,null,null,null,null,null,null,null,null,null,null,null,null,null,null,null,null,null,null,null,null,null,null,null,86]
[null,87,null,null,null,null,null,null,null,null,null,null,null,null,null,null,null,null,null,null,null,null,null,null,null,null,null,null,null,null,null,null,null,null,null,null,null,null,null,null,null,null,null,87]
[null,88,null,null,null,null,null,null,null,null,null,null,null,null,null,null,null,null,null,null,null,null,null,null,null,null,null,null,null,null,null,null,null,null,null,null,null,null,null,null,null,null,null,88]
[null,89,null,null,null,null,null,null,null,null,null,null,null,null,null,null,null,null,null,null,null,null,null,null,null,null,null,null,null,null,null,null,null,null,null,null,null,null,null,null,null,null,null,89]
[null,90,null,null,null,null,null,null,null,null,null,null,null,null,null,null,null,null,null,null,null,null,null,null,null,null,null,null,null,null,null,null,null,null,null,null,null,null,null,null,null,null,null,90]
[null,91,null,null,null,null,null,null,null,null,null,null,null,null,null,null,null,null,null,null,null,null,null,null,null,null,null,null,null,null,null,null,null,null,null,null,null,null,null,null,null,null,null,91]
[null,92,null,null,null,null,null,null,null,null,null,null,null,null,null,null,null,null,null,null,null,null,null,null,null,null,null,null,null,null,null,null,null,null,null,null,null,null,null,null,null,null,null,92]
[null,93,null,null,null,null,null,null,null,null,null,null,null,null,null,null,null,null,null,null,null,null,null,null,null,null,null,null,null,null,null,null,null,null,null,null,null,null,null,null,null,null,null,93]
[null,94,null,null,null,null,null,null,null,null,null,null,null,null,null,null,null,null,null,null,null,null,null,null,null,null,null,null,null,null,null,null,null,null,null,null,null,null,null,null,null,null,null,94]
[null,{"$f":"B106+1","v":95},null,null,null,null,null,null,null,null,null,null,null,null,null,null,null,null,null,null,null,null,null,null,null,null,null,null,null,null,null,null,null,null,null,null,null,null,null,null,null,null,null,95]
[null,96,null,null,null,null,null,null,null,null,null,null,null,null,null,null,null,null,null,null,null,null,null,null,null,null,null,null,null,null,null,null,null,null,null,null,null,null,null,null,null,null,null,96]
[null,97,null,null,null,null,null,null,null,null,null,null,null,null,null,null,null,null,null,null,null,null,null,null,null,null,null,null,null,null,null,null,null,null,null,null,null,null,null,null,null,null,null,97]
[null,98,null,null,null,null,null,null,null,null,null,null,null,null,null,null,null,null,null,null,null,null,null,null,null,null,null,null,null,null,null,null,null,null,null,null,null,null,null,null,null,null,null,98]
[null,99,null,null,null,null,null,null,null,null,null,null,null,null,null,null,null,null,null,null,null,null,null,null,null,null,null,null,null,null,null,null,null,null,null,null,null,null,null,null,null,null,null,99]
[null,100,null,null,null,null,null,null,null,null,null,null,null,null,null,null,null,null,null,null,null,null,null,null,null,null,null,null,null,null,null,null,null,null,null,null,null,null,null,null,null,null,null,100]
[]
[null,null,{"$f":"data!W12","v":0},null,null,null,null,null,null,null,"Totaal aantal partners"]
[]
[null,null,"Aantal partners per bouwsteen",null,null,null,null,null,null,null,{"$f":"data!X12","v":0},null,null,{"$f":"data!Y12","v":0},null,null,{"$f":"data!Z12","v":0},null,null,{"$f":"data!AA12","v":0},null,null,{"$f":"data!AB12","v":0},null,null,{"$f":"data!AC12","v":0},null,null,{"$f":"data!AD12","v":0},null,null,{"$f":"data!AE12","v":0},null,null,{"$f":"data!AF12","v":0},null,null,{"$f":"data!AG12","v":0},null,null,null,null,null,null,{"$f":"data!AH12","v":0},null,null,{"$f":"data!AI12","v":0},null,null,{"$f":"data!AJ12","v":0},null,null,{"$f":"data!AK12","v":0},null,null,{"$f":"data!AL12","v":0},null,null,{"$f":"data!AM12","v":0},null,null,{"$f":"data!AN12","v":0},null,null,{"$f":"data!AO12","v":0},null,null,{"$f":"data!AP12","v":0},null,null,{"$f":"data!AQ12","v":0}]

{"sheet":"data","index":4,"n_rows":229,"n_cols":60,"rows_kept":229,"cut":false,"hidden":true,"merged":[]}
["id_CA","naamCA"]
[1001,{"$f":"Vragenlijst!V13","v":0},null,null,null,null,1]
[]
[]
["id_CA","RapportJaar","invuldatum","Q02_ContactNaam","Q02_ContactEmail","Q02_ContactFunctie","Q02_ContactWerkgev"]
[{"$f":"A2","v":1001},{"$f":"RIGHT(Vragenlijst!M7,4)","v":"2025"},{"$f":"Vragenlijst!M8","v":"00:00:00"},{"$f":"Vragenlijst!V17","v":0},{"$f":"Vragenlijst!V18","v":0},{"$f":"Vragenlijst!V19","v":0},{"$f":"Vragenlijst!V20","v":0}]
[]
[]
[]
["organisatie",null,null,null,null,null,null,null,null,null,null,null,null,null,null,null,null,null,null,null,null,null,null,1,2,3,4,5,6,7,8,9,10,1,2,3,4,5,6,7,8,9,10]
["id_CA","RapportJaar","invuldatum","Q03_OntwikkelStadium","Q04_Gemeente1","Q04_Gemeente2","Q04_Gemeente3","Q04_Gemeente4","Q04_Gemeente5","Q04_Gemeente6","Q04_Gemeente7","Q04_Gemeente8","Q05_Doelstelling1","Q05_Doelstelling2","Q05_Doelstelling3","Q05_Doelstelling4","Q05_Doelstelling5","Q05_GeenDoelstelling","Q06_ToegevoegdeWaardeCA","Q07_structuur","Q07_StructuurAndersNamelijk","Q08_30+partners","Q08_AantalPartners","Q08_Milieustraat_aantal","Q08_Kringloopwinkel_aantal","Q08_Reparatie_aantal","Q08_Sociaal_aantal","Q08_Onderwijs_aantal","Q08_Werkplaats_aantal","Q08_deeleconomie_aantal","Q08_Ondernemers_aantal","Q08_Demontage_aantal","Q08_Alternatief_aantal","Q09_Milieustraat_aantal","Q09_Kringloopwinkel_aantal","Q09_Reparatie_aantal","Q09_Sociaal_aantal","Q09_Onderwijs_aantal","Q09_Werkplaats_aantal","Q09_deeleconomie_aantal","Q09_Ondernemers_aantal","Q09_Demontage_aantal","Q09_Alternatief_aantal","Q010_SamenwerkingWerkcentra"]
[{"$f":"data!A2","v":1001},{"$f":"$B$6","v":"2025"},{"$f":"$C$6","v":"00:00:00"},0,{"$f":"Vragenlijst!C31","v":0},{"$f":"Vragenlijst!C32","v":0},{"$f":"Vragenlijst!C33","v":0},{"$f":"Vragenlijst!C34","v":0},{"$f":"Vragenlijst!C35","v":0},{"$f":"Vragenlijst!C36","v":0},{"$f":"Vragenlijst!C37","v":0},{"$f":"Vragenlijst!C38","v":0},{"$f":"Vragenlijst!C45","v":0},{"$f":"Vragenlijst!C46","v":0},{"$f":"Vragenlijst!C47","v":0},{"$f":"Vragenlijst!C48","v":0},{"$f":"Vragenlijst!C49","v":0},{"$f":"Vragenlijst!AU51","v":0},{"$f":"Vragenlijst!C56","v":0},0,{"$f":"IF(T12=4,Vragenlijst!X69,0)","v":0},{"$f":"Vragenlijst!Z113","v":0},{"$f":"COUNTA(T17:T116)","v":0},{"$f":"COUNTIF($V$17:$V$116,X10)","v":0},0,0,0,0,0,0,0,0,0,{"$f":"COUNTIF($W$17:$W$116,AH10)","v":0},0,0,0,0,0,0,0,0,0,{"$f":"Vragenlijst!C164","v":0}]
[]
[]
["Partners",null,null,null,null,null,null,null,null,null,null,null,null,null,null,"deze gebruiken, want opgeschoond"]
["id_CA","RapportJaar","invuldatum","Q08_NaamPartner","Q08_PartnerID","Q08_Bouwsteen1","Q09_Bouwsteen2","Q16_kringloop","Q16_BKNlid","Q33_Vrijwilligers","Q34_SociaalNaam","A34_TypeSociaal","Q35_LidVanCedris","Q42_B2B","Q42_B2C",null,"id_CA","RapportJaar","invuldatum","Q08_NaamPartner","Q08_PartnerID","Q08_Bouwsteen1","Q09_Bouwsteen2","Q16_kringloop","Q16_BKNlid","Q15_ToestemmingData",{"$f":"J16","v":"Q33_Vrijwilligers"},"Q42_B2B","Q42_B2C","Q34a_SociaalNaam","A34b_TypeSociaal","Q35_LidVanCedris"]
[{"$f":"IF(Partners!C13=\"\",\"\",$A$2)","v":""},{"$f":"IF(Partners!C13=\"\",\"\",$B$6)","v":""},{"$f":"IF(Partners!C13=\"\",\"\",$C$6)","v":""},{"$f":"IF(Partners!C13=\"\",\"\",Partners!C13)","v":""},{"$f":"IF(Partners!C13=\"\",\"\",CONCATENATE(A17,\"000\",Partners!B13))","v":""},null,null,{"$f":"IF(OR(F17=2,G17=2),D17,\"\")","v":""},{"$f":"IFERROR(VLOOKUP(D17,Vragenlijst!$AY$236:$BA$245,3,FALSE),\"\")","v":""},{"$f":"IF(AND(D17<>\"\",D17<>0),IFERROR(VLOOKUP(D17,Vragenlijst!$C$451:$R$460,16,FALSE),\"nee\"),\"\")","v":""},{"$f":"IF(OR(F17=4,G17=4),D17,\"\")","v":""},{"$f":"IFERROR(VLOOKUP(K17,Vragenlijst!$AY$465:$BA$477,3,FALSE),\"\")","v":""},{"$f":"IFERROR(VLOOKUP(K17,Vragenlijst!$AY$482:$BB$494,4,FALSE),\"\")","v":""},{"$f":"IF(OR(D17=0,D17=\"\"),\"\",IFERROR(VLOOKUP(D17,Vragenlijst!$C$566:$K$570,9,FALSE),\"\"))","v":""},{"$f":"IF(OR(D17=0,D17=\"\"),\"\",IFERROR(VLOOKUP(D17,Vragenlijst!$C$566:$N$570,12,FALSE),\"\"))","v":""},null,{"$f":"_xlfn._xlws.FILTER(A17:O116,A17:A116<>\"\")","v":{"$error":"#VALUE!"}}]
[{"$f":"IF(Partners!C14=\"\",\"\",$A$2)","v":""},{"$f":"IF(Partners!C14=\"\",\"\",$B$6)","v":""},{"$f":"IF(Partners!C14=\"\",\"\",$C$6)","v":""},{"$f":"IF(Partners!C14=\"\",\"\",Partners!C14)","v":""},{"$f":"IF(Partners!C14=\"\",\"\",CONCATENATE(A18,\"000\",Partners!B14))","v":""},null,null,{"$f":"IF(OR(F18=2,G18=2),D18,\"\")","v":""},{"$f":"IFERROR(VLOOKUP(D18,Vragenlijst!$AY$236:$BA$245,3,FALSE),\"\")","v":""},{"$f":"IF(AND(D18<>\"\",D18<>0),IFERROR(VLOOKUP(D18,Vragenlijst!$C$451:$R$460,16,FALSE),\"nee\"),\"\")","v":""},{"$f":"IF(OR(F18=4,G18=4),D18,\"\")","v":""},{"$f":"IFERROR(VLOOKUP(K18,Vragenlijst!$AY$465:$BA$477,3,FALSE),\"\")","v":""},{"$f":"IFERROR(VLOOKUP(K18,Vragenlijst!$AY$482:$BB$494,4,FALSE),\"\")","v":""},{"$f":"IF(OR(D18=0,D18=\"\"),\"\",IFERROR(VLOOKUP(D18,Vragenlijst!$C$566:$K$570,9,FALSE),\"\"))","v":""},{"$f":"IF(OR(D18=0,D18=\"\"),\"\",IFERROR(VLOOKUP(D18,Vragenlijst!$C$566:$N$570,12,FALSE),\"\"))","v":""}]
[{"$f":"IF(Partners!C15=\"\",\"\",$A$2)","v":""},{"$f":"IF(Partners!C15=\"\",\"\",$B$6)","v":""},{"$f":"IF(Partners!C15=\"\",\"\",$C$6)","v":""},{"$f":"IF(Partners!C15=\"\",\"\",Partners!C15)","v":""},{"$f":"IF(Partners!C15=\"\",\"\",CONCATENATE(A19,\"000\",Partners!B15))","v":""},null,null,"",{"$f":"IFERROR(VLOOKUP(D19,Vragenlijst!$AY$236:$BA$245,3,FALSE),\"\")","v":""},{"$f":"IF(AND(D19<>\"\",D19<>0),IFERROR(VLOOKUP(D19,Vragenlijst!$C$451:$R$460,16,FALSE),\"nee\"),\"\")","v":""},"",{"$f":"IFERROR(VLOOKUP(K19,Vragenlijst!$AY$465:$BA$477,3,FALSE),\"\")","v":""},{"$f":"IFERROR(VLOOKUP(K19,Vragenlijst!$AY$482:$BB$494,4,FALSE),\"\")","v":""},{"$f":"IF(OR(D19=0,D19=\"\"),\"\",IFERROR(VLOOKUP(D19,Vragenlijst!$C$566:$K$570,9,FALSE),\"\"))","v":""},{"$f":"IF(OR(D19=0,D19=\"\"),\"\",IFERROR(VLOOKUP(D19,Vragenlijst!$C$566:$N$570,12,FALSE),\"\"))","v":""}]
[{"$f":"IF(Partners!C16=\"\",\"\",$A$2)","v":""},{"$f":"IF(Partners!C16=\"\",\"\",$B$6)","v":""},{"$f":"IF(Partners!C16=\"\",\"\",$C$6)","v":""},{"$f":"IF(Partners!C16=\"\",\"\",Partners!C16)","v":""},{"$f":"IF(Partners!C16=\"\",\"\",CONCATENATE(A20,\"000\",Partners!B16))","v":""},null,null,"",{"$f":"IFERROR(VLOOKUP(D20,Vragenlijst!$AY$236:$BA$245,3,FALSE),\"\")","v":""},{"$f":"IF(AND(D20<>\"\",D20<>0),IFERROR(VLOOKUP(D20,Vragenlijst!$C$451:$R$460,16,FALSE),\"nee\"),\"\")","v":""},"",{"$f":"IFERROR(VLOOKUP(K20,Vragenlijst!$AY$465:$BA$477,3,FALSE),\"\")","v":""},{"$f":"IFERROR(VLOOKUP(K20,Vragenlijst!$AY$482:$BB$494,4,FALSE),\"\")","v":""},{"$f":"IF(OR(D20=0,D20=\"\"),\"\",IFERROR(VLOOKUP(D20,Vragenlijst!$C$566:$K$570,9,FALSE),\"\"))","v":""},{"$f":"IF(OR(D20=0,D20=\"\"),\"\",IFERROR(VLOOKUP(D20,Vragenlijst!$C$566:$N$570,12,FALSE),\"\"))","v":""}]
[{"$f":"IF(Partners!C17=\"\",\"\",$A$2)","v":""},{"$f":"IF(Partners!C17=\"\",\"\",$B$6)","v":""},{"$f":"IF(Partners!C17=\"\",\"\",$C$6)","v":""},{"$f":"IF(Partners!C17=\"\",\"\",Partners!C17)","v":""},{"$f":"IF(Partners!C17=\"\",\"\",CONCATENATE(A21,\"000\",Partners!B17))","v":""},null,null,"",{"$f":"IFERROR(VLOOKUP(D21,Vragenlijst!$AY$236:$BA$245,3,FALSE),\"\")","v":""},{"$f":"IF(AND(D21<>\"\",D21<>0),IFERROR(VLOOKUP(D21,Vragenlijst!$C$451:$R$460,16,FALSE),\"nee\"),\"\")","v":""},"",{"$f":"IFERROR(VLOOKUP(K21,Vragenlijst!$AY$465:$BA$477,3,FALSE),\"\")","v":""},{"$f":"IFERROR(VLOOKUP(K21,Vragenlijst!$AY$482:$BB$494,4,FALSE),\"\")","v":""},{"$f":"IF(OR(D21=0,D21=\"\"),\"\",IFERROR(VLOOKUP(D21,Vragenlijst!$C$566:$K$570,9,FALSE),\"\"))","v":""},{"$f":"IF(OR(D21=0,D21=\"\"),\"\",IFERROR(VLOOKUP(D21,Vragenlijst!$C$566:$N$570,12,FALSE),\"\"))","v":""}]
[{"$f":"IF(Partners!C18=\"\",\"\",$A$2)","v":""},{"$f":"IF(Partners!C18=\"\",\"\",$B$6)","v":""},{"$f":"IF(Partners!C18=\"\",\"\",$C$6)","v":""},{"$f":"IF(Partners!C18=\"\",\"\",Partners!C18)","v":""},{"$f":"IF(Partners!C18=\"\",\"\",CONCATENATE(A22,\"000\",Partners!B18))","v":""},null,null,"",{"$f":"IFERROR(VLOOKUP(D22,Vragenlijst!$AY$236:$BA$245,3,FALSE),\"\")","v":""},{"$f":"IF(AND(D22<>\"\",D22<>0),IFERROR(VLOOKUP(D22,Vragenlijst!$C$451:$R$460,16,FALSE),\"nee\"),\"\")","v":""},"",{"$f":"IFERROR(VLOOKUP(K22,Vragenlijst!$AY$465:$BA$477,3,FALSE),\"\")","v":""},{"$f":"IFERROR(VLOOKUP(K22,Vragenlijst!$AY$482:$BB$494,4,FALSE),\"\")","v":""},{"$f":"IF(OR(D22=0,D22=\"\"),\"\",IFERROR(VLOOKUP(D22,Vragenlijst!$C$566:$K$570,9,FALSE),\"\"))","v":""},{"$f":"IF(OR(D22=0,D22=\"\"),\"\",IFERROR(VLOOKUP(D22,Vragenlijst!$C$566:$N$570,12,FALSE),\"\"))","v":""}]
[{"$f":"IF(Partners!C19=\"\",\"\",$A$2)","v":""},{"$f":"IF(Partners!C19=\"\",\"\",$B$6)","v":""},{"$f":"IF(Partners!C19=\"\",\"\",$C$6)","v":""},{"$f":"IF(Partners!C19=\"\",\"\",Partners!C19)","v":""},{"$f":"IF(Partners!C19=\"\",\"\",CONCATENATE(A23,\"000\",Partners!B19))","v":""},null,null,"",{"$f":"IFERROR(VLOOKUP(D23,Vragenlijst!$AY$236:$BA$245,3,FALSE),\"\")","v":""},{"$f":"IF(AND(D23<>\"\",D23<>0),IFERROR(VLOOKUP(D23,Vragenlijst!$C$451:$R$460,16,FALSE),\"nee\"),\"\")","v":""},"",{"$f":"IFERROR(VLOOKUP(K23,Vragenlijst!$AY$465:$BA$477,3,FALSE),\"\")","v":""},{"$f":"IFERROR(VLOOKUP(K23,Vragenlijst!$AY$482:$BB$494,4,FALSE),\"\")","v":""},{"$f":"IF(OR(D23=0,D23=\"\"),\"\",IFERROR(VLOOKUP(D23,Vragenlijst!$C$566:$K$570,9,FALSE),\"\"))","v":""},{"$f":"IF(OR(D23=0,D23=\"\"),\"\",IFERROR(VLOOKUP(D23,Vragenlijst!$C$566:$N$570,12,FALSE),\"\"))","v":""}]
[{"$f":"IF(Partners!C20=\"\",\"\",$A$2)","v":""},{"$f":"IF(Partners!C20=\"\",\"\",$B$6)","v":""},{"$f":"IF(Partners!C20=\"\",\"\",$C$6)","v":""},{"$f":"IF(Partners!C20=\"\",\"\",Partners!C20)","v":""},{"$f":"IF(Partners!C20=\"\",\"\",CONCATENATE(A24,\"000\",Partners!B20))","v":""},null,null,"",{"$f":"IFERROR(VLOOKUP(D24,Vragenlijst!$AY$236:$BA$245,3,FALSE),\"\")","v":""},{"$f":"IF(AND(D24<>\"\",D24<>0),IFERROR(VLOOKUP(D24,Vragenlijst!$C$451:$R$460,16,FALSE),\"nee\"),\"\")","v":""},"",{"$f":"IFERROR(VLOOKUP(K24,Vragenlijst!$AY$465:$BA$477,3,FALSE),\"\")","v":""},{"$f":"IFERROR(VLOOKUP(K24,Vragenlijst!$AY$482:$BB$494,4,FALSE),\"\")","v":""},{"$f":"IF(OR(D24=0,D24=\"\"),\"\",IFERROR(VLOOKUP(D24,Vragenlijst!$C$566:$K$570,9,FALSE),\"\"))","v":""},{"$f":"IF(OR(D24=0,D24=\"\"),\"\",IFERROR(VLOOKUP(D24,Vragenlijst!$C$566:$N$570,12,FALSE),\"\"))","v":""}]
[{"$f":"IF(Partners!C21=\"\",\"\",$A$2)","v":""},{"$f":"IF(Partners!C21=\"\",\"\",$B$6)","v":""},{"$f":"IF(Partners!C21=\"\",\"\",$C$6)","v":""},{"$f":"IF(Partners!C21=\"\",\"\",Partners!C21)","v":""},{"$f":"IF(Partners!C21=\"\",\"\",CONCATENATE(A25,\"000\",Partners!B21))","v":""},null,null,"",{"$f":"IFERROR(VLOOKUP(D25,Vragenlijst!$AY$236:$BA$245,3,FALSE),\"\")","v":""},{"$f":"IF(AND(D25<>\"\",D25<>0),IFERROR(VLOOKUP(D25,Vragenlijst!$C$451:$R$460,16,FALSE),\"nee\"),\"\")","v":""},"",{"$f":"IFERROR(VLOOKUP(K25,Vragenlijst!$AY$465:$BA$477,3,FALSE),\"\")","v":""},{"$f":"IFERROR(VLOOKUP(K25,Vragenlijst!$AY$482:$BB$494,4,FALSE),\"\")","v":""},{"$f":"IF(OR(D25=0,D25=\"\"),\"\",IFERROR(VLOOKUP(D25,Vragenlijst!$C$566:$K$570,9,FALSE),\"\"))","v":""},{"$f":"IF(OR(D25=0,D25=\"\"),\"\",IFERROR(VLOOKUP(D25,Vragenlijst!$C$566:$N$570,12,FALSE),\"\"))","v":""}]
[{"$f":"IF(Partners!C22=\"\",\"\",$A$2)","v":""},{"$f":"IF(Partners!C22=\"\",\"\",$B$6)","v":""},{"$f":"IF(Partners!C22=\"\",\"\",$C$6)","v":""},{"$f":"IF(Partners!C22=\"\",\"\",Partners!C22)","v":""},{"$f":"IF(Partners!C22=\"\",\"\",CONCATENATE(A26,\"000\",Partners!B22))","v":""},null,null,"",{"$f":"IFERROR(VLOOKUP(D26,Vragenlijst!$AY$236:$BA$245,3,FALSE),\"\")","v":""},{"$f":"IF(AND(D26<>\"\",D26<>0),IFERROR(VLOOKUP(D26,Vragenlijst!$C$451:$R$460,16,FALSE),\"nee\"),\"\")","v":""},"",{"$f":"IFERROR(VLOOKUP(K26,Vragenlijst!$AY$465:$BA$477,3,FALSE),\"\")","v":""},{"$f":"IFERROR(VLOOKUP(K26,Vragenlijst!$AY$482:$BB$494,4,FALSE),\"\")","v":""},{"$f":"IF(OR(D26=0,D26=\"\"),\"\",IFERROR(VLOOKUP(D26,Vragenlijst!$C$566:$K$570,9,FALSE),\"\"))","v":""},{"$f":"IF(OR(D26=0,D26=\"\"),\"\",IFERROR(VLOOKUP(D26,Vragenlijst!$C$566:$N$570,12,FALSE),\"\"))","v":""}]
[{"$f":"IF(Partners!C23=\"\",\"\",$A$2)","v":""},{"$f":"IF(Partners!C23=\"\",\"\",$B$6)","v":""},{"$f":"IF(Partners!C23=\"\",\"\",$C$6)","v":""},{"$f":"IF(Partners!C23=\"\",\"\",Partners!C23)","v":""},{"$f":"IF(Partners!C23=\"\",\"\",CONCATENATE(A27,\"000\",Partners!B23))","v":""},null,null,"",{"$f":"IFERROR(VLOOKUP(D27,Vragenlijst!$AY$236:$BA$245,3,FALSE),\"\")","v":""},{"$f":"IF(AND(D27<>\"\",D27<>0),IFERROR(VLOOKUP(D27,Vragenlijst!$C$451:$R$460,16,FALSE),\"nee\"),\"\")","v":""},"",{"$f":"IFERROR(VLOOKUP(K27,Vragenlijst!$AY$465:$BA$477,3,FALSE),\"\")","v":""},{"$f":"IFERROR(VLOOKUP(K27,Vragenlijst!$AY$482:$BB$494,4,FALSE),\"\")","v":""},{"$f":"IF(OR(D27=0,D27=\"\"),\"\",IFERROR(VLOOKUP(D27,Vragenlijst!$C$566:$K$570,9,FALSE),\"\"))","v":""},{"$f":"IF(OR(D27=0,D27=\"\"),\"\",IFERROR(VLOOKUP(D27,Vragenlijst!$C$566:$N$570,12,FALSE),\"\"))","v":""}]
[{"$f":"IF(Partners!C24=\"\",\"\",$A$2)","v":""},{"$f":"IF(Partners!C24=\"\",\"\",$B$6)","v":""},{"$f":"IF(Partners!C24=\"\",\"\",$C$6)","v":""},{"$f":"IF(Partners!C24=\"\",\"\",Partners!C24)","v":""},{"$f":"IF(Partners!C24=\"\",\"\",CONCATENATE(A28,\"000\",Partners!B24))","v":""},null,null,"",{"$f":"IFERROR(VLOOKUP(D28,Vragenlijst!$AY$236:$BA$245,3,FALSE),\"\")","v":""},{"$f":"IF(AND(D28<>\"\",D28<>0),IFERROR(VLOOKUP(D28,Vragenlijst!$C$451:$R$460,16,FALSE),\"nee\"),\"\")","v":""},"",{"$f":"IFERROR(VLOOKUP(K28,Vragenlijst!$AY$465:$BA$477,3,FALSE),\"\")","v":""},{"$f":"IFERROR(VLOOKUP(K28,Vragenlijst!$AY$482:$BB$494,4,FALSE),\"\")","v":""},{"$f":"IF(OR(D28=0,D28=\"\"),\"\",IFERROR(VLOOKUP(D28,Vragenlijst!$C$566:$K$570,9,FALSE),\"\"))","v":""},{"$f":"IF(OR(D28=0,D28=\"\"),\"\",IFERROR(VLOOKUP(D28,Vragenlijst!$C$566:$N$570,12,FALSE),\"\"))","v":""}]
[{"$f":"IF(Partners!C25=\"\",\"\",$A$2)","v":""},{"$f":"IF(Partners!C25=\"\",\"\",$B$6)","v":""},{"$f":"IF(Partners!C25=\"\",\"\",$C$6)","v":""},{"$f":"IF(Partners!C25=\"\",\"\",Partners!C25)","v":""},{"$f":"IF(Partners!C25=\"\",\"\",CONCATENATE(A29,\"000\",Partners!B25))","v":""},null,null,"",{"$f":"IFERROR(VLOOKUP(D29,Vragenlijst!$AY$236:$BA$245,3,FALSE),\"\")","v":""},{"$f":"IF(AND(D29<>\"\",D29<>0),IFERROR(VLOOKUP(D29,Vragenlijst!$C$451:$R$460,16,FALSE),\"nee\"),\"\")","v":""},"",{"$f":"IFERROR(VLOOKUP(K29,Vragenlijst!$AY$465:$BA$477,3,FALSE),\"\")","v":""},{"$f":"IFERROR(VLOOKUP(K29,Vragenlijst!$AY$482:$BB$494,4,FALSE),\"\")","v":""},{"$f":"IF(OR(D29=0,D29=\"\"),\"\",IFERROR(VLOOKUP(D29,Vragenlijst!$C$566:$K$570,9,FALSE),\"\"))","v":""},{"$f":"IF(OR(D29=0,D29=\"\"),\"\",IFERROR(VLOOKUP(D29,Vragenlijst!$C$566:$N$570,12,FALSE),\"\"))","v":""}]
[{"$f":"IF(Partners!C26=\"\",\"\",$A$2)","v":""},{"$f":"IF(Partners!C26=\"\",\"\",$B$6)","v":""},{"$f":"IF(Partners!C26=\"\",\"\",$C$6)","v":""},{"$f":"IF(Partners!C26=\"\",\"\",Partners!C26)","v":""},{"$f":"IF(Partners!C26=\"\",\"\",CONCATENATE(A30,\"000\",Partners!B26))","v":""},null,null,"",{"$f":"IFERROR(VLOOKUP(D30,Vragenlijst!$AY$236:$BA$245,3,FALSE),\"\")","v":""},{"$f":"IF(AND(D30<>\"\",D30<>0),IFERROR(VLOOKUP(D30,Vragenlijst!$C$451:$R$460,16,FALSE),\"nee\"),\"\")","v":""},"",{"$f":"IFERROR(VLOOKUP(K30,Vragenlijst!$AY$465:$BA$477,3,FALSE),\"\")","v":""},{"$f":"IFERROR(VLOOKUP(K30,Vragenlijst!$AY$482:$BB$494,4,FALSE),\"\")","v":""},{"$f":"IF(OR(D30=0,D30=\"\"),\"\",IFERROR(VLOOKUP(D30,Vragenlijst!$C$566:$K$570,9,FALSE),\"\"))","v":""},{"$f":"IF(OR(D30=0,D30=\"\"),\"\",IFERROR(VLOOKUP(D30,Vragenlijst!$C$566:$N$570,12,FALSE),\"\"))","v":""}]
[{"$f":"IF(Partners!C27=\"\",\"\",$A$2)","v":""},{"$f":"IF(Partners!C27=\"\",\"\",$B$6)","v":""},{"$f":"IF(Partners!C27=\"\",\"\",$C$6)","v":""},{"$f":"IF(Partners!C27=\"\",\"\",Partners!C27)","v":""},{"$f":"IF(Partners!C27=\"\",\"\",CONCATENATE(A31,\"000\",Partners!B27))","v":""},null,null,"",{"$f":"IFERROR(VLOOKUP(D31,Vragenlijst!$AY$236:$BA$245,3,FALSE),\"\")","v":""},{"$f":"IF(AND(D31<>\"\",D31<>0),IFERROR(VLOOKUP(D31,Vragenlijst!$C$451:$R$460,16,FALSE),\"nee\"),\"\")","v":""},"",{"$f":"IFERROR(VLOOKUP(K31,Vragenlijst!$AY$465:$BA$477,3,FALSE),\"\")","v":""},{"$f":"IFERROR(VLOOKUP(K31,Vragenlijst!$AY$482:$BB$494,4,FALSE),\"\")","v":""},{"$f":"IF(OR(D31=0,D31=\"\"),\"\",IFERROR(VLOOKUP(D31,Vragenlijst!$C$566:$K$570,9,FALSE),\"\"))","v":""},{"$f":"IF(OR(D31=0,D31=\"\"),\"\",IFERROR(VLOOKUP(D31,Vragenlijst!$C$566:$N$570,12,FALSE),\"\"))","v":""}]
[{"$f":"IF(Partners!C28=\"\",\"\",$A$2)","v":""},{"$f":"IF(Partners!C28=\"\",\"\",$B$6)","v":""},{"$f":"IF(Partners!C28=\"\",\"\",$C$6)","v":""},{"$f":"IF(Partners!C28=\"\",\"\",Partners!C28)","v":""},{"$f":"IF(Partners!C28=\"\",\"\",CONCATENATE(A32,\"000\",Partners!B28))","v":""},null,null,"",{"$f":"IFERROR(VLOOKUP(D32,Vragenlijst!$AY$236:$BA$245,3,FALSE),\"\")","v":""},{"$f":"IF(AND(D32<>\"\",D32<>0),IFERROR(VLOOKUP(D32,Vragenlijst!$C$451:$R$460,16,FALSE),\"nee\"),\"\")","v":""},"",{"$f":"IFERROR(VLOOKUP(K32,Vragenlijst!$AY$465:$BA$477,3,FALSE),\"\")","v":""},{"$f":"IFERROR(VLOOKUP(K32,Vragenlijst!$AY$482:$BB$494,4,FALSE),\"\")","v":""},{"$f":"IF(OR(D32=0,D32=\"\"),\"\",IFERROR(VLOOKUP(D32,Vragenlijst!$C$566:$K$570,9,FALSE),\"\"))","v":""},{"$f":"IF(OR(D32=0,D32=\"\"),\"\",IFERROR(VLOOKUP(D32,Vragenlijst!$C$566:$N$570,12,FALSE),\"\"))","v":""}]
[{"$f":"IF(Partners!C29=\"\",\"\",$A$2)","v":""},{"$f":"IF(Partners!C29=\"\",\"\",$B$6)","v":""},{"$f":"IF(Partners!C29=\"\",\"\",$C$6)","v":""},{"$f":"IF(Partners!C29=\"\",\"\",Partners!C29)","v":""},{"$f":"IF(Partners!C29=\"\",\"\",CONCATENATE(A33,\"000\",Partners!B29))","v":""},null,null,"",{"$f":"IFERROR(VLOOKUP(D33,Vragenlijst!$AY$236:$BA$245,3,FALSE),\"\")","v":""},{"$f":"IF(AND(D33<>\"\",D33<>0),IFERROR(VLOOKUP(D33,Vragenlijst!$C$451:$R$460,16,FALSE),\"nee\"),\"\")","v":""},"",{"$f":"IFERROR(VLOOKUP(K33,Vragenlijst!$AY$465:$BA$477,3,FALSE),\"\")","v":""},{"$f":"IFERROR(VLOOKUP(K33,Vragenlijst!$AY$482:$BB$494,4,FALSE),\"\")","v":""},{"$f":"IF(OR(D33=0,D33=\"\"),\"\",IFERROR(VLOOKUP(D33,Vragenlijst!$C$566:$K$570,9,FALSE),\"\"))","v":""},{"$f":"IF(OR(D33=0,D33=\"\"),\"\",IFERROR(VLOOKUP(D33,Vragenlijst!$C$566:$N$570,12,FALSE),\"\"))","v":""}]
[{"$f":"IF(Partners!C30=\"\",\"\",$A$2)","v":""},{"$f":"IF(Partners!C30=\"\",\"\",$B$6)","v":""},{"$f":"IF(Partners!C30=\"\",\"\",$C$6)","v":""},{"$f":"IF(Partners!C30=\"\",\"\",Partners!C30)","v":""},{"$f":"IF(Partners!C30=\"\",\"\",CONCATENATE(A34,\"000\",Partners!B30))","v":""},null,null,"",{"$f":"IFERROR(VLOOKUP(D34,Vragenlijst!$AY$236:$BA$245,3,FALSE),\"\")","v":""},{"$f":"IF(AND(D34<>\"\",D34<>0),IFERROR(VLOOKUP(D34,Vragenlijst!$C$451:$R$460,16,FALSE),\"nee\"),\"\")","v":""},"",{"$f":"IFERROR(VLOOKUP(K34,Vragenlijst!$AY$465:$BA$477,3,FALSE),\"\")","v":""},{"$f":"IFERROR(VLOOKUP(K34,Vragenlijst!$AY$482:$BB$494,4,FALSE),\"\")","v":""},{"$f":"IF(OR(D34=0,D34=\"\"),\"\",IFERROR(VLOOKUP(D34,Vragenlijst!$C$566:$K$570,9,FALSE),\"\"))","v":""},{"$f":"IF(OR(D34=0,D34=\"\"),\"\",IFERROR(VLOOKUP(D34,Vragenlijst!$C$566:$N$570,12,FALSE),\"\"))","v":""}]
[{"$f":"IF(Partners!C31=\"\",\"\",$A$2)","v":""},{"$f":"IF(Partners!C31=\"\",\"\",$B$6)","v":""},{"$f":"IF(Partners!C31=\"\",\"\",$C$6)","v":""},{"$f":"IF(Partners!C31=\"\",\"\",Partners!C31)","v":""},{"$f":"IF(Partners!C31=\"\",\"\",CONCATENATE(A35,\"000\",Partners!B31))","v":""},null,null,"",{"$f":"IFERROR(VLOOKUP(D35,Vragenlijst!$AY$236:$BA$245,3,FALSE),\"\")","v":""},{"$f":"IF(AND(D35<>\"\",D35<>0),IFERROR(VLOOKUP(D35,Vragenlijst!$C$451:$R$460,16,FALSE),\"nee\"),\"\")","v":""},"",{"$f":"IFERROR(VLOOKUP(K35,Vragenlijst!$AY$465:$BA$477,3,FALSE),\"\")","v":""},{"$f":"IFERROR(VLOOKUP(K35,Vragenlijst!$AY$482:$BB$494,4,FALSE),\"\")","v":""},{"$f":"IF(OR(D35=0,D35=\"\"),\"\",IFERROR(VLOOKUP(D35,Vragenlijst!$C$566:$K$570,9,FALSE),\"\"))","v":""},{"$f":"IF(OR(D35=0,D35=\"\"),\"\",IFERROR(VLOOKUP(D35,Vragenlijst!$C$566:$N$570,12,FALSE),\"\"))","v":""}]
[{"$f":"IF(Partners!C32=\"\",\"\",$A$2)","v":""},{"$f":"IF(Partners!C32=\"\",\"\",$B$6)","v":""},{"$f":"IF(Partners!C32=\"\",\"\",$C$6)","v":""},{"$f":"IF(Partners!C32=\"\",\"\",Partners!C32)","v":""},{"$f":"IF(Partners!C32=\"\",\"\",CONCATENATE(A36,\"000\",Partners!B32))","v":""},null,null,"",{"$f":"IFERROR(VLOOKUP(D36,Vragenlijst!$AY$236:$BA$245,3,FALSE),\"\")","v":""},{"$f":"IF(AND(D36<>\"\",D36<>0),IFERROR(VLOOKUP(D36,Vragenlijst!$C$451:$R$460,16,FALSE),\"nee\"),\"\")","v":""},"",{"$f":"IFERROR(VLOOKUP(K36,Vragenlijst!$AY$465:$BA$477,3,FALSE),\"\")","v":""},{"$f":"IFERROR(VLOOKUP(K36,Vragenlijst!$AY$482:$BB$494,4,FALSE),\"\")","v":""},{"$f":"IF(OR(D36=0,D36=\"\"),\"\",IFERROR(VLOOKUP(D36,Vragenlijst!$C$566:$K$570,9,FALSE),\"\"))","v":""},{"$f":"IF(OR(D36=0,D36=\"\"),\"\",IFERROR(VLOOKUP(D36,Vragenlijst!$C$566:$N$570,12,FALSE),\"\"))","v":""}]
[{"$f":"IF(Partners!C33=\"\",\"\",$A$2)","v":""},{"$f":"IF(Partners!C33=\"\",\"\",$B$6)","v":""},{"$f":"IF(Partners!C33=\"\",\"\",$C$6)","v":""},{"$f":"IF(Partners!C33=\"\",\"\",Partners!C33)","v":""},{"$f":"IF(Partners!C33=\"\",\"\",CONCATENATE(A37,\"000\",Partners!B33))","v":""},null,null,"",{"$f":"IFERROR(VLOOKUP(D37,Vragenlijst!$AY$236:$BA$245,3,FALSE),\"\")","v":""},{"$f":"IF(AND(D37<>\"\",D37<>0),IFERROR(VLOOKUP(D37,Vragenlijst!$C$451:$R$460,16,FALSE),\"nee\"),\"\")","v":""},"",{"$f":"IFERROR(VLOOKUP(K37,Vragenlijst!$AY$465:$BA$477,3,FALSE),\"\")","v":""},{"$f":"IFERROR(VLOOKUP(K37,Vragenlijst!$AY$482:$BB$494,4,FALSE),\"\")","v":""},{"$f":"IF(OR(D37=0,D37=\"\"),\"\",IFERROR(VLOOKUP(D37,Vragenlijst!$C$566:$K$570,9,FALSE),\"\"))","v":""},{"$f":"IF(OR(D37=0,D37=\"\"),\"\",IFERROR(VLOOKUP(D37,Vragenlijst!$C$566:$N$570,12,FALSE),\"\"))","v":""}]
[{"$f":"IF(Partners!C34=\"\",\"\",$A$2)","v":""},{"$f":"IF(Partners!C34=\"\",\"\",$B$6)","v":""},{"$f":"IF(Partners!C34=\"\",\"\",$C$6)","v":""},{"$f":"IF(Partners!C34=\"\",\"\",Partners!C34)","v":""},{"$f":"IF(Partners!C34=\"\",\"\",CONCATENATE(A38,\"000\",Partners!B34))","v":""},null,null,"",{"$f":"IFERROR(VLOOKUP(D38,Vragenlijst!$AY$236:$BA$245,3,FALSE),\"\")","v":""},{"$f":"IF(AND(D38<>\"\",D38<>0),IFERROR(VLOOKUP(D38,Vragenlijst!$C$451:$R$460,16,FALSE),\"nee\"),\"\")","v":""},"",{"$f":"IFERROR(VLOOKUP(K38,Vragenlijst!$AY$465:$BA$477,3,FALSE),\"\")","v":""},{"$f":"IFERROR(VLOOKUP(K38,Vragenlijst!$AY$482:$BB$494,4,FALSE),\"\")","v":""},{"$f":"IF(OR(D38=0,D38=\"\"),\"\",IFERROR(VLOOKUP(D38,Vragenlijst!$C$566:$K$570,9,FALSE),\"\"))","v":""},{"$f":"IF(OR(D38=0,D38=\"\"),\"\",IFERROR(VLOOKUP(D38,Vragenlijst!$C$566:$N$570,12,FALSE),\"\"))","v":""}]
[{"$f":"IF(Partners!C35=\"\",\"\",$A$2)","v":""},{"$f":"IF(Partners!C35=\"\",\"\",$B$6)","v":""},{"$f":"IF(Partners!C35=\"\",\"\",$C$6)","v":""},{"$f":"IF(Partners!C35=\"\",\"\",Partners!C35)","v":""},{"$f":"IF(Partners!C35=\"\",\"\",CONCATENATE(A39,\"000\",Partners!B35))","v":""},null,null,"",{"$f":"IFERROR(VLOOKUP(D39,Vragenlijst!$AY$236:$BA$245,3,FALSE),\"\")","v":""},{"$f":"IF(AND(D39<>\"\",D39<>0),IFERROR(VLOOKUP(D39,Vragenlijst!$C$451:$R$460,16,FALSE),\"nee\"),\"\")","v":""},"",{"$f":"IFERROR(VLOOKUP(K39,Vragenlijst!$AY$465:$BA$477,3,FALSE),\"\")","v":""},{"$f":"IFERROR(VLOOKUP(K39,Vragenlijst!$AY$482:$BB$494,4,FALSE),\"\")","v":""},{"$f":"IF(OR(D39=0,D39=\"\"),\"\",IFERROR(VLOOKUP(D39,Vragenlijst!$C$566:$K$570,9,FALSE),\"\"))","v":""},{"$f":"IF(OR(D39=0,D39=\"\"),\"\",IFERROR(VLOOKUP(D39,Vragenlijst!$C$566:$N$570,12,FALSE),\"\"))","v":""}]
[{"$f":"IF(Partners!C36=\"\",\"\",$A$2)","v":""},{"$f":"IF(Partners!C36=\"\",\"\",$B$6)","v":""},{"$f":"IF(Partners!C36=\"\",\"\",$C$6)","v":""},{"$f":"IF(Partners!C36=\"\",\"\",Partners!C36)","v":""},{"$f":"IF(Partners!C36=\"\",\"\",CONCATENATE(A40,\"000\",Partners!B36))","v":""},null,null,"",{"$f":"IFERROR(VLOOKUP(D40,Vragenlijst!$AY$236:$BA$245,3,FALSE),\"\")","v":""},{"$f":"IF(AND(D40<>\"\",D40<>0),IFERROR(VLOOKUP(D40,Vragenlijst!$C$451:$R$460,16,FALSE),\"nee\"),\"\")","v":""},"",{"$f":"IFERROR(VLOOKUP(K40,Vragenlijst!$AY$465:$BA$477,3,FALSE),\"\")","v":""},{"$f":"IFERROR(VLOOKUP(K40,Vragenlijst!$AY$482:$BB$494,4,FALSE),\"\")","v":""},{"$f":"IF(OR(D40=0,D40=\"\"),\"\",IFERROR(VLOOKUP(D40,Vragenlijst!$C$566:$K$570,9,FALSE),\"\"))","v":""},{"$f":"IF(OR(D40=0,D40=\"\"),\"\",IFERROR(VLOOKUP(D40,Vragenlijst!$C$566:$N$570,12,FALSE),\"\"))","v":""}]
[{"$f":"IF(Partners!C37=\"\",\"\",$A$2)","v":""},{"$f":"IF(Partners!C37=\"\",\"\",$B$6)","v":""},{"$f":"IF(Partners!C37=\"\",\"\",$C$6)","v":""},{"$f":"IF(Partners!C37=\"\",\"\",Partners!C37)","v":""},{"$f":"IF(Partners!C37=\"\",\"\",CONCATENATE(A41,\"000\",Partners!B37))","v":""},null,null,"",{"$f":"IFERROR(VLOOKUP(D41,Vragenlijst!$AY$236:$BA$245,3,FALSE),\"\")","v":""},{"$f":"IF(AND(D41<>\"\",D41<>0),IFERROR(VLOOKUP(D41,Vragenlijst!$C$451:$R$460,16,FALSE),\"nee\"),\"\")","v":""},"",{"$f":"IFERROR(VLOOKUP(K41,Vragenlijst!$AY$465:$BA$477,3,FALSE),\"\")","v":""},{"$f":"IFERROR(VLOOKUP(K41,Vragenlijst!$AY$482:$BB$494,4,FALSE),\"\")","v":""},{"$f":"IF(OR(D41=0,D41=\"\"),\"\",IFERROR(VLOOKUP(D41,Vragenlijst!$C$566:$K$570,9,FALSE),\"\"))","v":""},{"$f":"IF(OR(D41=0,D41=\"\"),\"\",IFERROR(VLOOKUP(D41,Vragenlijst!$C$566:$N$570,12,FALSE),\"\"))","v":""}]
[{"$f":"IF(Partners!C38=\"\",\"\",$A$2)","v":""},{"$f":"IF(Partners!C38=\"\",\"\",$B$6)","v":""},{"$f":"IF(Partners!C38=\"\",\"\",$C$6)","v":""},{"$f":"IF(Partners!C38=\"\",\"\",Partners!C38)","v":""},{"$f":"IF(Partners!C38=\"\",\"\",CONCATENATE(A42,\"000\",Partners!B38))","v":""},null,null,"",{"$f":"IFERROR(VLOOKUP(D42,Vragenlijst!$AY$236:$BA$245,3,FALSE),\"\")","v":""},{"$f":"IF(AND(D42<>\"\",D42<>0),IFERROR(VLOOKUP(D42,Vragenlijst!$C$451:$R$460,16,FALSE),\"nee\"),\"\")","v":""},"",{"$f":"IFERROR(VLOOKUP(K42,Vragenlijst!$AY$465:$BA$477,3,FALSE),\"\")","v":""},{"$f":"IFERROR(VLOOKUP(K42,Vragenlijst!$AY$482:$BB$494,4,FALSE),\"\")","v":""},{"$f":"IF(OR(D42=0,D42=\"\"),\"\",IFERROR(VLOOKUP(D42,Vragenlijst!$C$566:$K$570,9,FALSE),\"\"))","v":""},{"$f":"IF(OR(D42=0,D42=\"\"),\"\",IFERROR(VLOOKUP(D42,Vragenlijst!$C$566:$N$570,12,FALSE),\"\"))","v":""}]
[{"$f":"IF(Partners!C39=\"\",\"\",$A$2)","v":""},{"$f":"IF(Partners!C39=\"\",\"\",$B$6)","v":""},{"$f":"IF(Partners!C39=\"\",\"\",$C$6)","v":""},{"$f":"IF(Partners!C39=\"\",\"\",Partners!C39)","v":""},{"$f":"IF(Partners!C39=\"\",\"\",CONCATENATE(A43,\"000\",Partners!B39))","v":""},null,null,"",{"$f":"IFERROR(VLOOKUP(D43,Vragenlijst!$AY$236:$BA$245,3,FALSE),\"\")","v":""},{"$f":"IF(AND(D43<>\"\",D43<>0),IFERROR(VLOOKUP(D43,Vragenlijst!$C$451:$R$460,16,FALSE),\"nee\"),\"\")","v":""},"",{"$f":"IFERROR(VLOOKUP(K43,Vragenlijst!$AY$465:$BA$477,3,FALSE),\"\")","v":""},{"$f":"IFERROR(VLOOKUP(K43,Vragenlijst!$AY$482:$BB$494,4,FALSE),\"\")","v":""},{"$f":"IF(OR(D43=0,D43=\"\"),\"\",IFERROR(VLOOKUP(D43,Vragenlijst!$C$566:$K$570,9,FALSE),\"\"))","v":""},{"$f":"IF(OR(D43=0,D43=\"\"),\"\",IFERROR(VLOOKUP(D43,Vragenlijst!$C$566:$N$570,12,FALSE),\"\"))","v":""}]
[{"$f":"IF(Partners!C40=\"\",\"\",$A$2)","v":""},{"$f":"IF(Partners!C40=\"\",\"\",$B$6)","v":""},{"$f":"IF(Partners!C40=\"\",\"\",$C$6)","v":""},{"$f":"IF(Partners!C40=\"\",\"\",Partners!C40)","v":""},{"$f":"IF(Partners!C40=\"\",\"\",CONCATENATE(A44,\"000\",Partners!B40))","v":""},null,null,"",{"$f":"IFERROR(VLOOKUP(D44,Vragenlijst!$AY$236:$BA$245,3,FALSE),\"\")","v":""},{"$f":"IF(AND(D44<>\"\",D44<>0),IFERROR(VLOOKUP(D44,Vragenlijst!$C$451:$R$460,16,FALSE),\"nee\"),\"\")","v":""},"",{"$f":"IFERROR(VLOOKUP(K44,Vragenlijst!$AY$465:$BA$477,3,FALSE),\"\")","v":""},{"$f":"IFERROR(VLOOKUP(K44,Vragenlijst!$AY$482:$BB$494,4,FALSE),\"\")","v":""},{"$f":"IF(OR(D44=0,D44=\"\"),\"\",IFERROR(VLOOKUP(D44,Vragenlijst!$C$566:$K$570,9,FALSE),\"\"))","v":""},{"$f":"IF(OR(D44=0,D44=\"\"),\"\",IFERROR(VLOOKUP(D44,Vragenlijst!$C$566:$N$570,12,FALSE),\"\"))","v":""}]
[{"$f":"IF(Partners!C41=\"\",\"\",$A$2)","v":""},{"$f":"IF(Partners!C41=\"\",\"\",$B$6)","v":""},{"$f":"IF(Partners!C41=\"\",\"\",$C$6)","v":""},{"$f":"IF(Partners!C41=\"\",\"\",Partners!C41)","v":""},{"$f":"IF(Partners!C41=\"\",\"\",CONCATENATE(A45,\"000\",Partners!B41))","v":""},null,null,"",{"$f":"IFERROR(VLOOKUP(D45,Vragenlijst!$AY$236:$BA$245,3,FALSE),\"\")","v":""},{"$f":"IF(AND(D45<>\"\",D45<>0),IFERROR(VLOOKUP(D45,Vragenlijst!$C$451:$R$460,16,FALSE),\"nee\"),\"\")","v":""},"",{"$f":"IFERROR(VLOOKUP(K45,Vragenlijst!$AY$465:$BA$477,3,FALSE),\"\")","v":""},{"$f":"IFERROR(VLOOKUP(K45,Vragenlijst!$AY$482:$BB$494,4,FALSE),\"\")","v":""},{"$f":"IF(OR(D45=0,D45=\"\"),\"\",IFERROR(VLOOKUP(D45,Vragenlijst!$C$566:$K$570,9,FALSE),\"\"))","v":""},{"$f":"IF(OR(D45=0,D45=\"\"),\"\",IFERROR(VLOOKUP(D45,Vragenlijst!$C$566:$N$570,12,FALSE),\"\"))","v":""}]
[{"$f":"IF(Partners!C42=\"\",\"\",$A$2)","v":""},{"$f":"IF(Partners!C42=\"\",\"\",$B$6)","v":""},{"$f":"IF(Partners!C42=\"\",\"\",$C$6)","v":""},{"$f":"IF(Partners!C42=\"\",\"\",Partners!C42)","v":""},{"$f":"IF(Partners!C42=\"\",\"\",CONCATENATE(A46,\"000\",Partners!B42))","v":""},null,null,"",{"$f":"IFERROR(VLOOKUP(D46,Vragenlijst!$AY$236:$BA$245,3,FALSE),\"\")","v":""},{"$f":"IF(AND(D46<>\"\",D46<>0),IFERROR(VLOOKUP(D46,Vragenlijst!$C$451:$R$460,16,FALSE),\"nee\"),\"\")","v":""},"",{"$f":"IFERROR(VLOOKUP(K46,Vragenlijst!$AY$465:$BA$477,3,FALSE),\"\")","v":""},{"$f":"IFERROR(VLOOKUP(K46,Vragenlijst!$AY$482:$BB$494,4,FALSE),\"\")","v":""},{"$f":"IF(OR(D46=0,D46=\"\"),\"\",IFERROR(VLOOKUP(D46,Vragenlijst!$C$566:$K$570,9,FALSE),\"\"))","v":""},{"$f":"IF(OR(D46=0,D46=\"\"),\"\",IFERROR(VLOOKUP(D46,Vragenlijst!$C$566:$N$570,12,FALSE),\"\"))","v":""}]
[{"$f":"IF(Partners!C43=\"\",\"\",$A$2)","v":""},{"$f":"IF(Partners!C43=\"\",\"\",$B$6)","v":""},{"$f":"IF(Partners!C43=\"\",\"\",$C$6)","v":""},{"$f":"IF(Partners!C43=\"\",\"\",Partners!C43)","v":""},{"$f":"IF(Partners!C43=\"\",\"\",CONCATENATE(A47,\"000\",Partners!B43))","v":""},null,null,"",{"$f":"IFERROR(VLOOKUP(D47,Vragenlijst!$AY$236:$BA$245,3,FALSE),\"\")","v":""},{"$f":"IF(AND(D47<>\"\",D47<>0),IFERROR(VLOOKUP(D47,Vragenlijst!$C$451:$R$460,16,FALSE),\"nee\"),\"\")","v":""},"",{"$f":"IFERROR(VLOOKUP(K47,Vragenlijst!$AY$465:$BA$477,3,FALSE),\"\")","v":""},{"$f":"IFERROR(VLOOKUP(K47,Vragenlijst!$AY$482:$BB$494,4,FALSE),\"\")","v":""},{"$f":"IF(OR(D47=0,D47=\"\"),\"\",IFERROR(VLOOKUP(D47,Vragenlijst!$C$566:$K$570,9,FALSE),\"\"))","v":""},{"$f":"IF(OR(D47=0,D47=\"\"),\"\",IFERROR(VLOOKUP(D47,Vragenlijst!$C$566:$N$570,12,FALSE),\"\"))","v":""}]
[{"$f":"IF(Partners!C44=\"\",\"\",$A$2)","v":""},{"$f":"IF(Partners!C44=\"\",\"\",$B$6)","v":""},{"$f":"IF(Partners!C44=\"\",\"\",$C$6)","v":""},{"$f":"IF(Partners!C44=\"\",\"\",Partners!C44)","v":""},{"$f":"IF(Partners!C44=\"\",\"\",CONCATENATE(A48,\"000\",Partners!B44))","v":""},null,null,"",{"$f":"IFERROR(VLOOKUP(D48,Vragenlijst!$AY$236:$BA$245,3,FALSE),\"\")","v":""},{"$f":"IF(AND(D48<>\"\",D48<>0),IFERROR(VLOOKUP(D48,Vragenlijst!$C$451:$R$460,16,FALSE),\"nee\"),\"\")","v":""},"",{"$f":"IFERROR(VLOOKUP(K48,Vragenlijst!$AY$465:$BA$477,3,FALSE),\"\")","v":""},{"$f":"IFERROR(VLOOKUP(K48,Vragenlijst!$AY$482:$BB$494,4,FALSE),\"\")","v":""},{"$f":"IF(OR(D48=0,D48=\"\"),\"\",IFERROR(VLOOKUP(D48,Vragenlijst!$C$566:$K$570,9,FALSE),\"\"))","v":""},{"$f":"IF(OR(D48=0,D48=\"\"),\"\",IFERROR(VLOOKUP(D48,Vragenlijst!$C$566:$N$570,12,FALSE),\"\"))","v":""}]
[{"$f":"IF(Partners!C45=\"\",\"\",$A$2)","v":""},{"$f":"IF(Partners!C45=\"\",\"\",$B$6)","v":""},{"$f":"IF(Partners!C45=\"\",\"\",$C$6)","v":""},{"$f":"IF(Partners!C45=\"\",\"\",Partners!C45)","v":""},{"$f":"IF(Partners!C45=\"\",\"\",CONCATENATE(A49,\"000\",Partners!B45))","v":""},null,null,"",{"$f":"IFERROR(VLOOKUP(D49,Vragenlijst!$AY$236:$BA$245,3,FALSE),\"\")","v":""},{"$f":"IF(AND(D49<>\"\",D49<>0),IFERROR(VLOOKUP(D49,Vragenlijst!$C$451:$R$460,16,FALSE),\"nee\"),\"\")","v":""},"",{"$f":"IFERROR(VLOOKUP(K49,Vragenlijst!$AY$465:$BA$477,3,FALSE),\"\")","v":""},{"$f":"IFERROR(VLOOKUP(K49,Vragenlijst!$AY$482:$BB$494,4,FALSE),\"\")","v":""},{"$f":"IF(OR(D49=0,D49=\"\"),\"\",IFERROR(VLOOKUP(D49,Vragenlijst!$C$566:$K$570,9,FALSE),\"\"))","v":""},{"$f":"IF(OR(D49=0,D49=\"\"),\"\",IFERROR(VLOOKUP(D49,Vragenlijst!$C$566:$N$570,12,FALSE),\"\"))","v":""}]
[{"$f":"IF(Partners!C46=\"\",\"\",$A$2)","v":""},{"$f":"IF(Partners!C46=\"\",\"\",$B$6)","v":""},{"$f":"IF(Partners!C46=\"\",\"\",$C$6)","v":""},{"$f":"IF(Partners!C46=\"\",\"\",Partners!C46)","v":""},{"$f":"IF(Partners!C46=\"\",\"\",CONCATENATE(A50,\"000\",Partners!B46))","v":""},null,null,"",{"$f":"IFERROR(VLOOKUP(D50,Vragenlijst!$AY$236:$BA$245,3,FALSE),\"\")","v":""},{"$f":"IF(AND(D50<>\"\",D50<>0),IFERROR(VLOOKUP(D50,Vragenlijst!$C$451:$R$460,16,FALSE),\"nee\"),\"\")","v":""},"",{"$f":"IFERROR(VLOOKUP(K50,Vragenlijst!$AY$465:$BA$477,3,FALSE),\"\")","v":""},{"$f":"IFERROR(VLOOKUP(K50,Vragenlijst!$AY$482:$BB$494,4,FALSE),\"\")","v":""},{"$f":"IF(OR(D50=0,D50=\"\"),\"\",IFERROR(VLOOKUP(D50,Vragenlijst!$C$566:$K$570,9,FALSE),\"\"))","v":""},{"$f":"IF(OR(D50=0,D50=\"\"),\"\",IFERROR(VLOOKUP(D50,Vragenlijst!$C$566:$N$570,12,FALSE),\"\"))","v":""}]
[{"$f":"IF(Partners!C47=\"\",\"\",$A$2)","v":""},{"$f":"IF(Partners!C47=\"\",\"\",$B$6)","v":""},{"$f":"IF(Partners!C47=\"\",\"\",$C$6)","v":""},{"$f":"IF(Partners!C47=\"\",\"\",Partners!C47)","v":""},{"$f":"IF(Partners!C47=\"\",\"\",CONCATENATE(A51,\"000\",Partners!B47))","v":""},null,null,"",{"$f":"IFERROR(VLOOKUP(D51,Vragenlijst!$AY$236:$BA$245,3,FALSE),\"\")","v":""},{"$f":"IF(AND(D51<>\"\",D51<>0),IFERROR(VLOOKUP(D51,Vragenlijst!$C$451:$R$460,16,FALSE),\"nee\"),\"\")","v":""},"",{"$f":"IFERROR(VLOOKUP(K51,Vragenlijst!$AY$465:$BA$477,3,FALSE),\"\")","v":""},{"$f":"IFERROR(VLOOKUP(K51,Vragenlijst!$AY$482:$BB$494,4,FALSE),\"\")","v":""},{"$f":"IF(OR(D51=0,D51=\"\"),\"\",IFERROR(VLOOKUP(D51,Vragenlijst!$C$566:$K$570,9,FALSE),\"\"))","v":""},{"$f":"IF(OR(D51=0,D51=\"\"),\"\",IFERROR(VLOOKUP(D51,Vragenlijst!$C$566:$N$570,12,FALSE),\"\"))","v":""}]
[{"$f":"IF(Partners!C48=\"\",\"\",$A$2)","v":""},{"$f":"IF(Partners!C48=\"\",\"\",$B$6)","v":""},{"$f":"IF(Partners!C48=\"\",\"\",$C$6)","v":""},{"$f":"IF(Partners!C48=\"\",\"\",Partners!C48)","v":""},{"$f":"IF(Partners!C48=\"\",\"\",CONCATENATE(A52,\"000\",Partners!B48))","v":""},null,null,"",{"$f":"IFERROR(VLOOKUP(D52,Vragenlijst!$AY$236:$BA$245,3,FALSE),\"\")","v":""},{"$f":"IF(AND(D52<>\"\",D52<>0),IFERROR(VLOOKUP(D52,Vragenlijst!$C$451:$R$460,16,FALSE),\"nee\"),\"\")","v":""},"",{"$f":"IFERROR(VLOOKUP(K52,Vragenlijst!$AY$465:$BA$477,3,FALSE),\"\")","v":""},{"$f":"IFERROR(VLOOKUP(K52,Vragenlijst!$AY$482:$BB$494,4,FALSE),\"\")","v":""},{"$f":"IF(OR(D52=0,D52=\"\"),\"\",IFERROR(VLOOKUP(D52,Vragenlijst!$C$566:$K$570,9,FALSE),\"\"))","v":""},{"$f":"IF(OR(D52=0,D52=\"\"),\"\",IFERROR(VLOOKUP(D52,Vragenlijst!$C$566:$N$570,12,FALSE),\"\"))","v":""}]
[{"$f":"IF(Partners!C49=\"\",\"\",$A$2)","v":""},{"$f":"IF(Partners!C49=\"\",\"\",$B$6)","v":""},{"$f":"IF(Partners!C49=\"\",\"\",$C$6)","v":""},{"$f":"IF(Partners!C49=\"\",\"\",Partners!C49)","v":""},{"$f":"IF(Partners!C49=\"\",\"\",CONCATENATE(A53,\"000\",Partners!B49))","v":""},null,null,"",{"$f":"IFERROR(VLOOKUP(D53,Vragenlijst!$AY$236:$BA$245,3,FALSE),\"\")","v":""},{"$f":"IF(AND(D53<>\"\",D53<>0),IFERROR(VLOOKUP(D53,Vragenlijst!$C$451:$R$460,16,FALSE),\"nee\"),\"\")","v":""},"",{"$f":"IFERROR(VLOOKUP(K53,Vragenlijst!$AY$465:$BA$477,3,FALSE),\"\")","v":""},{"$f":"IFERROR(VLOOKUP(K53,Vragenlijst!$AY$482:$BB$494,4,FALSE),\"\")","v":""},{"$f":"IF(OR(D53=0,D53=\"\"),\"\",IFERROR(VLOOKUP(D53,Vragenlijst!$C$566:$K$570,9,FALSE),\"\"))","v":""},{"$f":"IF(OR(D53=0,D53=\"\"),\"\",IFERROR(VLOOKUP(D53,Vragenlijst!$C$566:$N$570,12,FALSE),\"\"))","v":""}]
[{"$f":"IF(Partners!C50=\"\",\"\",$A$2)","v":""},{"$f":"IF(Partners!C50=\"\",\"\",$B$6)","v":""},{"$f":"IF(Partners!C50=\"\",\"\",$C$6)","v":""},{"$f":"IF(Partners!C50=\"\",\"\",Partners!C50)","v":""},{"$f":"IF(Partners!C50=\"\",\"\",CONCATENATE(A54,\"000\",Partners!B50))","v":""},null,null,"",{"$f":"IFERROR(VLOOKUP(D54,Vragenlijst!$AY$236:$BA$245,3,FALSE),\"\")","v":""},{"$f":"IF(AND(D54<>\"\",D54<>0),IFERROR(VLOOKUP(D54,Vragenlijst!$C$451:$R$460,16,FALSE),\"nee\"),\"\")","v":""},"",{"$f":"IFERROR(VLOOKUP(K54,Vragenlijst!$AY$465:$BA$477,3,FALSE),\"\")","v":""},{"$f":"IFERROR(VLOOKUP(K54,Vragenlijst!$AY$482:$BB$494,4,FALSE),\"\")","v":""},{"$f":"IF(OR(D54=0,D54=\"\"),\"\",IFERROR(VLOOKUP(D54,Vragenlijst!$C$566:$K$570,9,FALSE),\"\"))","v":""},{"$f":"IF(OR(D54=0,D54=\"\"),\"\",IFERROR(VLOOKUP(D54,Vragenlijst!$C$566:$N$570,12,FALSE),\"\"))","v":""}]
[{"$f":"IF(Partners!C51=\"\",\"\",$A$2)","v":""},{"$f":"IF(Partners!C51=\"\",\"\",$B$6)","v":""},{"$f":"IF(Partners!C51=\"\",\"\",$C$6)","v":""},{"$f":"IF(Partners!C51=\"\",\"\",Partners!C51)","v":""},{"$f":"IF(Partners!C51=\"\",\"\",CONCATENATE(A55,\"000\",Partners!B51))","v":""},null,null,"",{"$f":"IFERROR(VLOOKUP(D55,Vragenlijst!$AY$236:$BA$245,3,FALSE),\"\")","v":""},{"$f":"IF(AND(D55<>\"\",D55<>0),IFERROR(VLOOKUP(D55,Vragenlijst!$C$451:$R$460,16,FALSE),\"nee\"),\"\")","v":""},"",{"$f":"IFERROR(VLOOKUP(K55,Vragenlijst!$AY$465:$BA$477,3,FALSE),\"\")","v":""},{"$f":"IFERROR(VLOOKUP(K55,Vragenlijst!$AY$482:$BB$494,4,FALSE),\"\")","v":""},{"$f":"IF(OR(D55=0,D55=\"\"),\"\",IFERROR(VLOOKUP(D55,Vragenlijst!$C$566:$K$570,9,FALSE),\"\"))","v":""},{"$f":"IF(OR(D55=0,D55=\"\"),\"\",IFERROR(VLOOKUP(D55,Vragenlijst!$C$566:$N$570,12,FALSE),\"\"))","v":""}]
[{"$f":"IF(Partners!C52=\"\",\"\",$A$2)","v":""},{"$f":"IF(Partners!C52=\"\",\"\",$B$6)","v":""},{"$f":"IF(Partners!C52=\"\",\"\",$C$6)","v":""},{"$f":"IF(Partners!C52=\"\",\"\",Partners!C52)","v":""},{"$f":"IF(Partners!C52=\"\",\"\",CONCATENATE(A56,\"000\",Partners!B52))","v":""},null,null,"",{"$f":"IFERROR(VLOOKUP(D56,Vragenlijst!$AY$236:$BA$245,3,FALSE),\"\")","v":""},{"$f":"IF(AND(D56<>\"\",D56<>0),IFERROR(VLOOKUP(D56,Vragenlijst!$C$451:$R$460,16,FALSE),\"nee\"),\"\")","v":""},"",{"$f":"IFERROR(VLOOKUP(K56,Vragenlijst!$AY$465:$BA$477,3,FALSE),\"\")","v":""},{"$f":"IFERROR(VLOOKUP(K56,Vragenlijst!$AY$482:$BB$494,4,FALSE),\"\")","v":""},{"$f":"IF(OR(D56=0,D56=\"\"),\"\",IFERROR(VLOOKUP(D56,Vragenlijst!$C$566:$K$570,9,FALSE),\"\"))","v":""},{"$f":"IF(OR(D56=0,D56=\"\"),\"\",IFERROR(VLOOKUP(D56,Vragenlijst!$C$566:$N$570,12,FALSE),\"\"))","v":""}]
[{"$f":"IF(Partners!C53=\"\",\"\",$A$2)","v":""},{"$f":"IF(Partners!C53=\"\",\"\",$B$6)","v":""},{"$f":"IF(Partners!C53=\"\",\"\",$C$6)","v":""},{"$f":"IF(Partners!C53=\"\",\"\",Partners!C53)","v":""},{"$f":"IF(Partners!C53=\"\",\"\",CONCATENATE(A57,\"000\",Partners!B53))","v":""},null,null,"",{"$f":"IFERROR(VLOOKUP(D57,Vragenlijst!$AY$236:$BA$245,3,FALSE),\"\")","v":""},{"$f":"IF(AND(D57<>\"\",D57<>0),IFERROR(VLOOKUP(D57,Vragenlijst!$C$451:$R$460,16,FALSE),\"nee\"),\"\")","v":""},"",{"$f":"IFERROR(VLOOKUP(K57,Vragenlijst!$AY$465:$BA$477,3,FALSE),\"\")","v":""},{"$f":"IFERROR(VLOOKUP(K57,Vragenlijst!$AY$482:$BB$494,4,FALSE),\"\")","v":""},{"$f":"IF(OR(D57=0,D57=\"\"),\"\",IFERROR(VLOOKUP(D57,Vragenlijst!$C$566:$K$570,9,FALSE),\"\"))","v":""},{"$f":"IF(OR(D57=0,D57=\"\"),\"\",IFERROR(VLOOKUP(D57,Vragenlijst!$C$566:$N$570,12,FALSE),\"\"))","v":""}]
[{"$f":"IF(Partners!C54=\"\",\"\",$A$2)","v":""},{"$f":"IF(Partners!C54=\"\",\"\",$B$6)","v":""},{"$f":"IF(Partners!C54=\"\",\"\",$C$6)","v":""},{"$f":"IF(Partners!C54=\"\",\"\",Partners!C54)","v":""},{"$f":"IF(Partners!C54=\"\",\"\",CONCATENATE(A58,\"000\",Partners!B54))","v":""},null,null,"",{"$f":"IFERROR(VLOOKUP(D58,Vragenlijst!$AY$236:$BA$245,3,FALSE),\"\")","v":""},{"$f":"IF(AND(D58<>\"\",D58<>0),IFERROR(VLOOKUP(D58,Vragenlijst!$C$451:$R$460,16,FALSE),\"nee\"),\"\")","v":""},"",{"$f":"IFERROR(VLOOKUP(K58,Vragenlijst!$AY$465:$BA$477,3,FALSE),\"\")","v":""},{"$f":"IFERROR(VLOOKUP(K58,Vragenlijst!$AY$482:$BB$494,4,FALSE),\"\")","v":""},{"$f":"IF(OR(D58=0,D58=\"\"),\"\",IFERROR(VLOOKUP(D58,Vragenlijst!$C$566:$K$570,9,FALSE),\"\"))","v":""},{"$f":"IF(OR(D58=0,D58=\"\"),\"\",IFERROR(VLOOKUP(D58,Vragenlijst!$C$566:$N$570,12,FALSE),\"\"))","v":""}]
[{"$f":"IF(Partners!C55=\"\",\"\",$A$2)","v":""},{"$f":"IF(Partners!C55=\"\",\"\",$B$6)","v":""},{"$f":"IF(Partners!C55=\"\",\"\",$C$6)","v":""},{"$f":"IF(Partners!C55=\"\",\"\",Partners!C55)","v":""},{"$f":"IF(Partners!C55=\"\",\"\",CONCATENATE(A59,\"000\",Partners!B55))","v":""},null,null,"",{"$f":"IFERROR(VLOOKUP(D59,Vragenlijst!$AY$236:$BA$245,3,FALSE),\"\")","v":""},{"$f":"IF(AND(D59<>\"\",D59<>0),IFERROR(VLOOKUP(D59,Vragenlijst!$C$451:$R$460,16,FALSE),\"nee\"),\"\")","v":""},"",{"$f":"IFERROR(VLOOKUP(K59,Vragenlijst!$AY$465:$BA$477,3,FALSE),\"\")","v":""},{"$f":"IFERROR(VLOOKUP(K59,Vragenlijst!$AY$482:$BB$494,4,FALSE),\"\")","v":""},{"$f":"IF(OR(D59=0,D59=\"\"),\"\",IFERROR(VLOOKUP(D59,Vragenlijst!$C$566:$K$570,9,FALSE),\"\"))","v":""},{"$f":"IF(OR(D59=0,D59=\"\"),\"\",IFERROR(VLOOKUP(D59,Vragenlijst!$C$566:$N$570,12,FALSE),\"\"))","v":""}]
[{"$f":"IF(Partners!C56=\"\",\"\",$A$2)","v":""},{"$f":"IF(Partners!C56=\"\",\"\",$B$6)","v":""},{"$f":"IF(Partners!C56=\"\",\"\",$C$6)","v":""},{"$f":"IF(Partners!C56=\"\",\"\",Partners!C56)","v":""},{"$f":"IF(Partners!C56=\"\",\"\",CONCATENATE(A60,\"000\",Partners!B56))","v":""},null,null,"",{"$f":"IFERROR(VLOOKUP(D60,Vragenlijst!$AY$236:$BA$245,3,FALSE),\"\")","v":""},{"$f":"IF(AND(D60<>\"\",D60<>0),IFERROR(VLOOKUP(D60,Vragenlijst!$C$451:$R$460,16,FALSE),\"nee\"),\"\")","v":""},"",{"$f":"IFERROR(VLOOKUP(K60,Vragenlijst!$AY$465:$BA$477,3,FALSE),\"\")","v":""},{"$f":"IFERROR(VLOOKUP(K60,Vragenlijst!$AY$482:$BB$494,4,FALSE),\"\")","v":""},{"$f":"IF(OR(D60=0,D60=\"\"),\"\",IFERROR(VLOOKUP(D60,Vragenlijst!$C$566:$K$570,9,FALSE),\"\"))","v":""},{"$f":"IF(OR(D60=0,D60=\"\"),\"\",IFERROR(VLOOKUP(D60,Vragenlijst!$C$566:$N$570,12,FALSE),\"\"))","v":""}]
[{"$f":"IF(Partners!C57=\"\",\"\",$A$2)","v":""},{"$f":"IF(Partners!C57=\"\",\"\",$B$6)","v":""},{"$f":"IF(Partners!C57=\"\",\"\",$C$6)","v":""},{"$f":"IF(Partners!C57=\"\",\"\",Partners!C57)","v":""},{"$f":"IF(Partners!C57=\"\",\"\",CONCATENATE(A61,\"000\",Partners!B57))","v":""},null,null,"",{"$f":"IFERROR(VLOOKUP(D61,Vragenlijst!$AY$236:$BA$245,3,FALSE),\"\")","v":""},{"$f":"IF(AND(D61<>\"\",D61<>0),IFERROR(VLOOKUP(D61,Vragenlijst!$C$451:$R$460,16,FALSE),\"nee\"),\"\")","v":""},"",{"$f":"IFERROR(VLOOKUP(K61,Vragenlijst!$AY$465:$BA$477,3,FALSE),\"\")","v":""},{"$f":"IFERROR(VLOOKUP(K61,Vragenlijst!$AY$482:$BB$494,4,FALSE),\"\")","v":""},{"$f":"IF(OR(D61=0,D61=\"\"),\"\",IFERROR(VLOOKUP(D61,Vragenlijst!$C$566:$K$570,9,FALSE),\"\"))","v":""},{"$f":"IF(OR(D61=0,D61=\"\"),\"\",IFERROR(VLOOKUP(D61,Vragenlijst!$C$566:$N$570,12,FALSE),\"\"))","v":""}]
[{"$f":"IF(Partners!C58=\"\",\"\",$A$2)","v":""},{"$f":"IF(Partners!C58=\"\",\"\",$B$6)","v":""},{"$f":"IF(Partners!C58=\"\",\"\",$C$6)","v":""},{"$f":"IF(Partners!C58=\"\",\"\",Partners!C58)","v":""},{"$f":"IF(Partners!C58=\"\",\"\",CONCATENATE(A62,\"000\",Partners!B58))","v":""},null,null,"",{"$f":"IFERROR(VLOOKUP(D62,Vragenlijst!$AY$236:$BA$245,3,FALSE),\"\")","v":""},{"$f":"IF(AND(D62<>\"\",D62<>0),IFERROR(VLOOKUP(D62,Vragenlijst!$C$451:$R$460,16,FALSE),\"nee\"),\"\")","v":""},"",{"$f":"IFERROR(VLOOKUP(K62,Vragenlijst!$AY$465:$BA$477,3,FALSE),\"\")","v":""},{"$f":"IFERROR(VLOOKUP(K62,Vragenlijst!$AY$482:$BB$494,4,FALSE),\"\")","v":""},{"$f":"IF(OR(D62=0,D62=\"\"),\"\",IFERROR(VLOOKUP(D62,Vragenlijst!$C$566:$K$570,9,FALSE),\"\"))","v":""},{"$f":"IF(OR(D62=0,D62=\"\"),\"\",IFERROR(VLOOKUP(D62,Vragenlijst!$C$566:$N$570,12,FALSE),\"\"))","v":""}]
[{"$f":"IF(Partners!C59=\"\",\"\",$A$2)","v":""},{"$f":"IF(Partners!C59=\"\",\"\",$B$6)","v":""},{"$f":"IF(Partners!C59=\"\",\"\",$C$6)","v":""},{"$f":"IF(Partners!C59=\"\",\"\",Partners!C59)","v":""},{"$f":"IF(Partners!C59=\"\",\"\",CONCATENATE(A63,\"000\",Partners!B59))","v":""},null,null,"",{"$f":"IFERROR(VLOOKUP(D63,Vragenlijst!$AY$236:$BA$245,3,FALSE),\"\")","v":""},{"$f":"IF(AND(D63<>\"\",D63<>0),IFERROR(VLOOKUP(D63,Vragenlijst!$C$451:$R$460,16,FALSE),\"nee\"),\"\")","v":""},"",{"$f":"IFERROR(VLOOKUP(K63,Vragenlijst!$AY$465:$BA$477,3,FALSE),\"\")","v":""},{"$f":"IFERROR(VLOOKUP(K63,Vragenlijst!$AY$482:$BB$494,4,FALSE),\"\")","v":""},{"$f":"IF(OR(D63=0,D63=\"\"),\"\",IFERROR(VLOOKUP(D63,Vragenlijst!$C$566:$K$570,9,FALSE),\"\"))","v":""},{"$f":"IF(OR(D63=0,D63=\"\"),\"\",IFERROR(VLOOKUP(D63,Vragenlijst!$C$566:$N$570,12,FALSE),\"\"))","v":""}]
[{"$f":"IF(Partners!C60=\"\",\"\",$A$2)","v":""},{"$f":"IF(Partners!C60=\"\",\"\",$B$6)","v":""},{"$f":"IF(Partners!C60=\"\",\"\",$C$6)","v":""},{"$f":"IF(Partners!C60=\"\",\"\",Partners!C60)","v":""},{"$f":"IF(Partners!C60=\"\",\"\",CONCATENATE(A64,\"000\",Partners!B60))","v":""},null,null,"",{"$f":"IFERROR(VLOOKUP(D64,Vragenlijst!$AY$236:$BA$245,3,FALSE),\"\")","v":""},{"$f":"IF(AND(D64<>\"\",D64<>0),IFERROR(VLOOKUP(D64,Vragenlijst!$C$451:$R$460,16,FALSE),\"nee\"),\"\")","v":""},"",{"$f":"IFERROR(VLOOKUP(K64,Vragenlijst!$AY$465:$BA$477,3,FALSE),\"\")","v":""},{"$f":"IFERROR(VLOOKUP(K64,Vragenlijst!$AY$482:$BB$494,4,FALSE),\"\")","v":""},{"$f":"IF(OR(D64=0,D64=\"\"),\"\",IFERROR(VLOOKUP(D64,Vragenlijst!$C$566:$K$570,9,FALSE),\"\"))","v":""},{"$f":"IF(OR(D64=0,D64=\"\"),\"\",IFERROR(VLOOKUP(D64,Vragenlijst!$C$566:$N$570,12,FALSE),\"\"))","v":""}]
[{"$f":"IF(Partners!C61=\"\",\"\",$A$2)","v":""},{"$f":"IF(Partners!C61=\"\",\"\",$B$6)","v":""},{"$f":"IF(Partners!C61=\"\",\"\",$C$6)","v":""},{"$f":"IF(Partners!C61=\"\",\"\",Partners!C61)","v":""},{"$f":"IF(Partners!C61=\"\",\"\",CONCATENATE(A65,\"000\",Partners!B61))","v":""},null,null,"",{"$f":"IFERROR(VLOOKUP(D65,Vragenlijst!$AY$236:$BA$245,3,FALSE),\"\")","v":""},{"$f":"IF(AND(D65<>\"\",D65<>0),IFERROR(VLOOKUP(D65,Vragenlijst!$C$451:$R$460,16,FALSE),\"nee\"),\"\")","v":""},"",{"$f":"IFERROR(VLOOKUP(K65,Vragenlijst!$AY$465:$BA$477,3,FALSE),\"\")","v":""},{"$f":"IFERROR(VLOOKUP(K65,Vragenlijst!$AY$482:$BB$494,4,FALSE),\"\")","v":""},{"$f":"IF(OR(D65=0,D65=\"\"),\"\",IFERROR(VLOOKUP(D65,Vragenlijst!$C$566:$K$570,9,FALSE),\"\"))","v":""},{"$f":"IF(OR(D65=0,D65=\"\"),\"\",IFERROR(VLOOKUP(D65,Vragenlijst!$C$566:$N$570,12,FALSE),\"\"))","v":""}]
[{"$f":"IF(Partners!C62=\"\",\"\",$A$2)","v":""},{"$f":"IF(Partners!C62=\"\",\"\",$B$6)","v":""},{"$f":"IF(Partners!C62=\"\",\"\",$C$6)","v":""},{"$f":"IF(Partners!C62=\"\",\"\",Partners!C62)","v":""},{"$f":"IF(Partners!C62=\"\",\"\",CONCATENATE(A66,\"000\",Partners!B62))","v":""},null,null,"",{"$f":"IFERROR(VLOOKUP(D66,Vragenlijst!$AY$236:$BA$245,3,FALSE),\"\")","v":""},{"$f":"IF(AND(D66<>\"\",D66<>0),IFERROR(VLOOKUP(D66,Vragenlijst!$C$451:$R$460,16,FALSE),\"nee\"),\"\")","v":""},"",{"$f":"IFERROR(VLOOKUP(K66,Vragenlijst!$AY$465:$BA$477,3,FALSE),\"\")","v":""},{"$f":"IFERROR(VLOOKUP(K66,Vragenlijst!$AY$482:$BB$494,4,FALSE),\"\")","v":""},{"$f":"IF(OR(D66=0,D66=\"\"),\"\",IFERROR(VLOOKUP(D66,Vragenlijst!$C$566:$K$570,9,FALSE),\"\"))","v":""},{"$f":"IF(OR(D66=0,D66=\"\"),\"\",IFERROR(VLOOKUP(D66,Vragenlijst!$C$566:$N$570,12,FALSE),\"\"))","v":""}]
[{"$f":"IF(Partners!C63=\"\",\"\",$A$2)","v":""},{"$f":"IF(Partners!C63=\"\",\"\",$B$6)","v":""},{"$f":"IF(Partners!C63=\"\",\"\",$C$6)","v":""},{"$f":"IF(Partners!C63=\"\",\"\",Partners!C63)","v":""},{"$f":"IF(Partners!C63=\"\",\"\",CONCATENATE(A67,\"000\",Partners!B63))","v":""},null,null,"",{"$f":"IFERROR(VLOOKUP(D67,Vragenlijst!$AY$236:$BA$245,3,FALSE),\"\")","v":""},{"$f":"IF(AND(D67<>\"\",D67<>0),IFERROR(VLOOKUP(D67,Vragenlijst!$C$451:$R$460,16,FALSE),\"nee\"),\"\")","v":""},"",{"$f":"IFERROR(VLOOKUP(K67,Vragenlijst!$AY$465:$BA$477,3,FALSE),\"\")","v":""},{"$f":"IFERROR(VLOOKUP(K67,Vragenlijst!$AY$482:$BB$494,4,FALSE),\"\")","v":""},{"$f":"IF(OR(D67=0,D67=\"\"),\"\",IFERROR(VLOOKUP(D67,Vragenlijst!$C$566:$K$570,9,FALSE),\"\"))","v":""},{"$f":"IF(OR(D67=0,D67=\"\"),\"\",IFERROR(VLOOKUP(D67,Vragenlijst!$C$566:$N$570,12,FALSE),\"\"))","v":""}]
[{"$f":"IF(Partners!C64=\"\",\"\",$A$2)","v":""},{"$f":"IF(Partners!C64=\"\",\"\",$B$6)","v":""},{"$f":"IF(Partners!C64=\"\",\"\",$C$6)","v":""},{"$f":"IF(Partners!C64=\"\",\"\",Partners!C64)","v":""},{"$f":"IF(Partners!C64=\"\",\"\",CONCATENATE(A68,\"000\",Partners!B64))","v":""},null,null,"",{"$f":"IFERROR(VLOOKUP(D68,Vragenlijst!$AY$236:$BA$245,3,FALSE),\"\")","v":""},{"$f":"IF(AND(D68<>\"\",D68<>0),IFERROR(VLOOKUP(D68,Vragenlijst!$C$451:$R$460,16,FALSE),\"nee\"),\"\")","v":""},"",{"$f":"IFERROR(VLOOKUP(K68,Vragenlijst!$AY$465:$BA$477,3,FALSE),\"\")","v":""},{"$f":"IFERROR(VLOOKUP(K68,Vragenlijst!$AY$482:$BB$494,4,FALSE),\"\")","v":""},{"$f":"IF(OR(D68=0,D68=\"\"),\"\",IFERROR(VLOOKUP(D68,Vragenlijst!$C$566:$K$570,9,FALSE),\"\"))","v":""},{"$f":"IF(OR(D68=0,D68=\"\"),\"\",IFERROR(VLOOKUP(D68,Vragenlijst!$C$566:$N$570,12,FALSE),\"\"))","v":""}]
[{"$f":"IF(Partners!C65=\"\",\"\",$A$2)","v":""},{"$f":"IF(Partners!C65=\"\",\"\",$B$6)","v":""},{"$f":"IF(Partners!C65=\"\",\"\",$C$6)","v":""},{"$f":"IF(Partners!C65=\"\",\"\",Partners!C65)","v":""},{"$f":"IF(Partners!C65=\"\",\"\",CONCATENATE(A69,\"000\",Partners!B65))","v":""},null,null,"",{"$f":"IFERROR(VLOOKUP(D69,Vragenlijst!$AY$236:$BA$245,3,FALSE),\"\")","v":""},{"$f":"IF(AND(D69<>\"\",D69<>0),IFERROR(VLOOKUP(D69,Vragenlijst!$C$451:$R$460,16,FALSE),\"nee\"),\"\")","v":""},"",{"$f":"IFERROR(VLOOKUP(K69,Vragenlijst!$AY$465:$BA$477,3,FALSE),\"\")","v":""},{"$f":"IFERROR(VLOOKUP(K69,Vragenlijst!$AY$482:$BB$494,4,FALSE),\"\")","v":""},{"$f":"IF(OR(D69=0,D69=\"\"),\"\",IFERROR(VLOOKUP(D69,Vragenlijst!$C$566:$K$570,9,FALSE),\"\"))","v":""},{"$f":"IF(OR(D69=0,D69=\"\"),\"\",IFERROR(VLOOKUP(D69,Vragenlijst!$C$566:$N$570,12,FALSE),\"\"))","v":""}]
[{"$f":"IF(Partners!C66=\"\",\"\",$A$2)","v":""},{"$f":"IF(Partners!C66=\"\",\"\",$B$6)","v":""},{"$f":"IF(Partners!C66=\"\",\"\",$C$6)","v":""},{"$f":"IF(Partners!C66=\"\",\"\",Partners!C66)","v":""},{"$f":"IF(Partners!C66=\"\",\"\",CONCATENATE(A70,\"000\",Partners!B66))","v":""},null,null,"",{"$f":"IFERROR(VLOOKUP(D70,Vragenlijst!$AY$236:$BA$245,3,FALSE),\"\")","v":""},{"$f":"IF(AND(D70<>\"\",D70<>0),IFERROR(VLOOKUP(D70,Vragenlijst!$C$451:$R$460,16,FALSE),\"nee\"),\"\")","v":""},"",{"$f":"IFERROR(VLOOKUP(K70,Vragenlijst!$AY$465:$BA$477,3,FALSE),\"\")","v":""},{"$f":"IFERROR(VLOOKUP(K70,Vragenlijst!$AY$482:$BB$494,4,FALSE),\"\")","v":""},{"$f":"IF(OR(D70=0,D70=\"\"),\"\",IFERROR(VLOOKUP(D70,Vragenlijst!$C$566:$K$570,9,FALSE),\"\"))","v":""},{"$f":"IF(OR(D70=0,D70=\"\"),\"\",IFERROR(VLOOKUP(D70,Vragenlijst!$C$566:$N$570,12,FALSE),\"\"))","v":""}]
[{"$f":"IF(Partners!C67=\"\",\"\",$A$2)","v":""},{"$f":"IF(Partners!C67=\"\",\"\",$B$6)","v":""},{"$f":"IF(Partners!C67=\"\",\"\",$C$6)","v":""},{"$f":"IF(Partners!C67=\"\",\"\",Partners!C67)","v":""},{"$f":"IF(Partners!C67=\"\",\"\",CONCATENATE(A71,\"000\",Partners!B67))","v":""},null,null,"",{"$f":"IFERROR(VLOOKUP(D71,Vragenlijst!$AY$236:$BA$245,3,FALSE),\"\")","v":""},{"$f":"IF(AND(D71<>\"\",D71<>0),IFERROR(VLOOKUP(D71,Vragenlijst!$C$451:$R$460,16,FALSE),\"nee\"),\"\")","v":""},"",{"$f":"IFERROR(VLOOKUP(K71,Vragenlijst!$AY$465:$BA$477,3,FALSE),\"\")","v":""},{"$f":"IFERROR(VLOOKUP(K71,Vragenlijst!$AY$482:$BB$494,4,FALSE),\"\")","v":""},{"$f":"IF(OR(D71=0,D71=\"\"),\"\",IFERROR(VLOOKUP(D71,Vragenlijst!$C$566:$K$570,9,FALSE),\"\"))","v":""},{"$f":"IF(OR(D71=0,D71=\"\"),\"\",IFERROR(VLOOKUP(D71,Vragenlijst!$C$566:$N$570,12,FALSE),\"\"))","v":""}]
[{"$f":"IF(Partners!C68=\"\",\"\",$A$2)","v":""},{"$f":"IF(Partners!C68=\"\",\"\",$B$6)","v":""},{"$f":"IF(Partners!C68=\"\",\"\",$C$6)","v":""},{"$f":"IF(Partners!C68=\"\",\"\",Partners!C68)","v":""},{"$f":"IF(Partners!C68=\"\",\"\",CONCATENATE(A72,\"000\",Partners!B68))","v":""},null,null,"",{"$f":"IFERROR(VLOOKUP(D72,Vragenlijst!$AY$236:$BA$245,3,FALSE),\"\")","v":""},{"$f":"IF(AND(D72<>\"\",D72<>0),IFERROR(VLOOKUP(D72,Vragenlijst!$C$451:$R$460,16,FALSE),\"nee\"),\"\")","v":""},"",{"$f":"IFERROR(VLOOKUP(K72,Vragenlijst!$AY$465:$BA$477,3,FALSE),\"\")","v":""},{"$f":"IFERROR(VLOOKUP(K72,Vragenlijst!$AY$482:$BB$494,4,FALSE),\"\")","v":""},{"$f":"IF(OR(D72=0,D72=\"\"),\"\",IFERROR(VLOOKUP(D72,Vragenlijst!$C$566:$K$570,9,FALSE),\"\"))","v":""},{"$f":"IF(OR(D72=0,D72=\"\"),\"\",IFERROR(VLOOKUP(D72,Vragenlijst!$C$566:$N$570,12,FALSE),\"\"))","v":""}]
[{"$f":"IF(Partners!C69=\"\",\"\",$A$2)","v":""},{"$f":"IF(Partners!C69=\"\",\"\",$B$6)","v":""},{"$f":"IF(Partners!C69=\"\",\"\",$C$6)","v":""},{"$f":"IF(Partners!C69=\"\",\"\",Partners!C69)","v":""},{"$f":"IF(Partners!C69=\"\",\"\",CONCATENATE(A73,\"000\",Partners!B69))","v":""},null,null,"",{"$f":"IFERROR(VLOOKUP(D73,Vragenlijst!$AY$236:$BA$245,3,FALSE),\"\")","v":""},{"$f":"IF(AND(D73<>\"\",D73<>0),IFERROR(VLOOKUP(D73,Vragenlijst!$C$451:$R$460,16,FALSE),\"nee\"),\"\")","v":""},"",{"$f":"IFERROR(VLOOKUP(K73,Vragenlijst!$AY$465:$BA$477,3,FALSE),\"\")","v":""},{"$f":"IFERROR(VLOOKUP(K73,Vragenlijst!$AY$482:$BB$494,4,FALSE),\"\")","v":""},{"$f":"IF(OR(D73=0,D73=\"\"),\"\",IFERROR(VLOOKUP(D73,Vragenlijst!$C$566:$K$570,9,FALSE),\"\"))","v":""},{"$f":"IF(OR(D73=0,D73=\"\"),\"\",IFERROR(VLOOKUP(D73,Vragenlijst!$C$566:$N$570,12,FALSE),\"\"))","v":""}]
[{"$f":"IF(Partners!C70=\"\",\"\",$A$2)","v":""},{"$f":"IF(Partners!C70=\"\",\"\",$B$6)","v":""},{"$f":"IF(Partners!C70=\"\",\"\",$C$6)","v":""},{"$f":"IF(Partners!C70=\"\",\"\",Partners!C70)","v":""},{"$f":"IF(Partners!C70=\"\",\"\",CONCATENATE(A74,\"000\",Partners!B70))","v":""},null,null,"",{"$f":"IFERROR(VLOOKUP(D74,Vragenlijst!$AY$236:$BA$245,3,FALSE),\"\")","v":""},{"$f":"IF(AND(D74<>\"\",D74<>0),IFERROR(VLOOKUP(D74,Vragenlijst!$C$451:$R$460,16,FALSE),\"nee\"),\"\")","v":""},"",{"$f":"IFERROR(VLOOKUP(K74,Vragenlijst!$AY$465:$BA$477,3,FALSE),\"\")","v":""},{"$f":"IFERROR(VLOOKUP(K74,Vragenlijst!$AY$482:$BB$494,4,FALSE),\"\")","v":""},{"$f":"IF(OR(D74=0,D74=\"\"),\"\",IFERROR(VLOOKUP(D74,Vragenlijst!$C$566:$K$570,9,FALSE),\"\"))","v":""},{"$f":"IF(OR(D74=0,D74=\"\"),\"\",IFERROR(VLOOKUP(D74,Vragenlijst!$C$566:$N$570,12,FALSE),\"\"))","v":""}]
[{"$f":"IF(Partners!C71=\"\",\"\",$A$2)","v":""},{"$f":"IF(Partners!C71=\"\",\"\",$B$6)","v":""},{"$f":"IF(Partners!C71=\"\",\"\",$C$6)","v":""},{"$f":"IF(Partners!C71=\"\",\"\",Partners!C71)","v":""},{"$f":"IF(Partners!C71=\"\",\"\",CONCATENATE(A75,\"000\",Partners!B71))","v":""},null,null,"",{"$f":"IFERROR(VLOOKUP(D75,Vragenlijst!$AY$236:$BA$245,3,FALSE),\"\")","v":""},{"$f":"IF(AND(D75<>\"\",D75<>0),IFERROR(VLOOKUP(D75,Vragenlijst!$C$451:$R$460,16,FALSE),\"nee\"),\"\")","v":""},"",{"$f":"IFERROR(VLOOKUP(K75,Vragenlijst!$AY$465:$BA$477,3,FALSE),\"\")","v":""},{"$f":"IFERROR(VLOOKUP(K75,Vragenlijst!$AY$482:$BB$494,4,FALSE),\"\")","v":""},{"$f":"IF(OR(D75=0,D75=\"\"),\"\",IFERROR(VLOOKUP(D75,Vragenlijst!$C$566:$K$570,9,FALSE),\"\"))","v":""},{"$f":"IF(OR(D75=0,D75=\"\"),\"\",IFERROR(VLOOKUP(D75,Vragenlijst!$C$566:$N$570,12,FALSE),\"\"))","v":""}]
[{"$f":"IF(Partners!C72=\"\",\"\",$A$2)","v":""},{"$f":"IF(Partners!C72=\"\",\"\",$B$6)","v":""},{"$f":"IF(Partners!C72=\"\",\"\",$C$6)","v":""},{"$f":"IF(Partners!C72=\"\",\"\",Partners!C72)","v":""},{"$f":"IF(Partners!C72=\"\",\"\",CONCATENATE(A76,\"000\",Partners!B72))","v":""},null,null,"",{"$f":"IFERROR(VLOOKUP(D76,Vragenlijst!$AY$236:$BA$245,3,FALSE),\"\")","v":""},{"$f":"IF(AND(D76<>\"\",D76<>0),IFERROR(VLOOKUP(D76,Vragenlijst!$C$451:$R$460,16,FALSE),\"nee\"),\"\")","v":""},"",{"$f":"IFERROR(VLOOKUP(K76,Vragenlijst!$AY$465:$BA$477,3,FALSE),\"\")","v":""},{"$f":"IFERROR(VLOOKUP(K76,Vragenlijst!$AY$482:$BB$494,4,FALSE),\"\")","v":""},{"$f":"IF(OR(D76=0,D76=\"\"),\"\",IFERROR(VLOOKUP(D76,Vragenlijst!$C$566:$K$570,9,FALSE),\"\"))","v":""},{"$f":"IF(OR(D76=0,D76=\"\"),\"\",IFERROR(VLOOKUP(D76,Vragenlijst!$C$566:$N$570,12,FALSE),\"\"))","v":""}]
[{"$f":"IF(Partners!C73=\"\",\"\",$A$2)","v":""},{"$f":"IF(Partners!C73=\"\",\"\",$B$6)","v":""},{"$f":"IF(Partners!C73=\"\",\"\",$C$6)","v":""},{"$f":"IF(Partners!C73=\"\",\"\",Partners!C73)","v":""},{"$f":"IF(Partners!C73=\"\",\"\",CONCATENATE(A77,\"000\",Partners!B73))","v":""},null,null,"",{"$f":"IFERROR(VLOOKUP(D77,Vragenlijst!$AY$236:$BA$245,3,FALSE),\"\")","v":""},{"$f":"IF(AND(D77<>\"\",D77<>0),IFERROR(VLOOKUP(D77,Vragenlijst!$C$451:$R$460,16,FALSE),\"nee\"),\"\")","v":""},"",{"$f":"IFERROR(VLOOKUP(K77,Vragenlijst!$AY$465:$BA$477,3,FALSE),\"\")","v":""},{"$f":"IFERROR(VLOOKUP(K77,Vragenlijst!$AY$482:$BB$494,4,FALSE),\"\")","v":""},{"$f":"IF(OR(D77=0,D77=\"\"),\"\",IFERROR(VLOOKUP(D77,Vragenlijst!$C$566:$K$570,9,FALSE),\"\"))","v":""},{"$f":"IF(OR(D77=0,D77=\"\"),\"\",IFERROR(VLOOKUP(D77,Vragenlijst!$C$566:$N$570,12,FALSE),\"\"))","v":""}]
[{"$f":"IF(Partners!C74=\"\",\"\",$A$2)","v":""},{"$f":"IF(Partners!C74=\"\",\"\",$B$6)","v":""},{"$f":"IF(Partners!C74=\"\",\"\",$C$6)","v":""},{"$f":"IF(Partners!C74=\"\",\"\",Partners!C74)","v":""},{"$f":"IF(Partners!C74=\"\",\"\",CONCATENATE(A78,\"000\",Partners!B74))","v":""},null,null,"",{"$f":"IFERROR(VLOOKUP(D78,Vragenlijst!$AY$236:$BA$245,3,FALSE),\"\")","v":""},{"$f":"IF(AND(D78<>\"\",D78<>0),IFERROR(VLOOKUP(D78,Vragenlijst!$C$451:$R$460,16,FALSE),\"nee\"),\"\")","v":""},"",{"$f":"IFERROR(VLOOKUP(K78,Vragenlijst!$AY$465:$BA$477,3,FALSE),\"\")","v":""},{"$f":"IFERROR(VLOOKUP(K78,Vragenlijst!$AY$482:$BB$494,4,FALSE),\"\")","v":""},{"$f":"IF(OR(D78=0,D78=\"\"),\"\",IFERROR(VLOOKUP(D78,Vragenlijst!$C$566:$K$570,9,FALSE),\"\"))","v":""},{"$f":"IF(OR(D78=0,D78=\"\"),\"\",IFERROR(VLOOKUP(D78,Vragenlijst!$C$566:$N$570,12,FALSE),\"\"))","v":""}]
[{"$f":"IF(Partners!C75=\"\",\"\",$A$2)","v":""},{"$f":"IF(Partners!C75=\"\",\"\",$B$6)","v":""},{"$f":"IF(Partners!C75=\"\",\"\",$C$6)","v":""},{"$f":"IF(Partners!C75=\"\",\"\",Partners!C75)","v":""},{"$f":"IF(Partners!C75=\"\",\"\",CONCATENATE(A79,\"000\",Partners!B75))","v":""},null,null,"",{"$f":"IFERROR(VLOOKUP(D79,Vragenlijst!$AY$236:$BA$245,3,FALSE),\"\")","v":""},{"$f":"IF(AND(D79<>\"\",D79<>0),IFERROR(VLOOKUP(D79,Vragenlijst!$C$451:$R$460,16,FALSE),\"nee\"),\"\")","v":""},"",{"$f":"IFERROR(VLOOKUP(K79,Vragenlijst!$AY$465:$BA$477,3,FALSE),\"\")","v":""},{"$f":"IFERROR(VLOOKUP(K79,Vragenlijst!$AY$482:$BB$494,4,FALSE),\"\")","v":""},{"$f":"IF(OR(D79=0,D79=\"\"),\"\",IFERROR(VLOOKUP(D79,Vragenlijst!$C$566:$K$570,9,FALSE),\"\"))","v":""},{"$f":"IF(OR(D79=0,D79=\"\"),\"\",IFERROR(VLOOKUP(D79,Vragenlijst!$C$566:$N$570,12,FALSE),\"\"))","v":""}]
[{"$f":"IF(Partners!C76=\"\",\"\",$A$2)","v":""},{"$f":"IF(Partners!C76=\"\",\"\",$B$6)","v":""},{"$f":"IF(Partners!C76=\"\",\"\",$C$6)","v":""},{"$f":"IF(Partners!C76=\"\",\"\",Partners!C76)","v":""},{"$f":"IF(Partners!C76=\"\",\"\",CONCATENATE(A80,\"000\",Partners!B76))","v":""},null,null,"",{"$f":"IFERROR(VLOOKUP(D80,Vragenlijst!$AY$236:$BA$245,3,FALSE),\"\")","v":""},{"$f":"IF(AND(D80<>\"\",D80<>0),IFERROR(VLOOKUP(D80,Vragenlijst!$C$451:$R$460,16,FALSE),\"nee\"),\"\")","v":""},"",{"$f":"IFERROR(VLOOKUP(K80,Vragenlijst!$AY$465:$BA$477,3,FALSE),\"\")","v":""},{"$f":"IFERROR(VLOOKUP(K80,Vragenlijst!$AY$482:$BB$494,4,FALSE),\"\")","v":""},{"$f":"IF(OR(D80=0,D80=\"\"),\"\",IFERROR(VLOOKUP(D80,Vragenlijst!$C$566:$K$570,9,FALSE),\"\"))","v":""},{"$f":"IF(OR(D80=0,D80=\"\"),\"\",IFERROR(VLOOKUP(D80,Vragenlijst!$C$566:$N$570,12,FALSE),\"\"))","v":""}]
[{"$f":"IF(Partners!C77=\"\",\"\",$A$2)","v":""},{"$f":"IF(Partners!C77=\"\",\"\",$B$6)","v":""},{"$f":"IF(Partners!C77=\"\",\"\",$C$6)","v":""},{"$f":"IF(Partners!C77=\"\",\"\",Partners!C77)","v":""},{"$f":"IF(Partners!C77=\"\",\"\",CONCATENATE(A81,\"000\",Partners!B77))","v":""},null,null,"",{"$f":"IFERROR(VLOOKUP(D81,Vragenlijst!$AY$236:$BA$245,3,FALSE),\"\")","v":""},{"$f":"IF(AND(D81<>\"\",D81<>0),IFERROR(VLOOKUP(D81,Vragenlijst!$C$451:$R$460,16,FALSE),\"nee\"),\"\")","v":""},"",{"$f":"IFERROR(VLOOKUP(K81,Vragenlijst!$AY$465:$BA$477,3,FALSE),\"\")","v":""},{"$f":"IFERROR(VLOOKUP(K81,Vragenlijst!$AY$482:$BB$494,4,FALSE),\"\")","v":""},{"$f":"IF(OR(D81=0,D81=\"\"),\"\",IFERROR(VLOOKUP(D81,Vragenlijst!$C$566:$K$570,9,FALSE),\"\"))","v":""},{"$f":"IF(OR(D81=0,D81=\"\"),\"\",IFERROR(VLOOKUP(D81,Vragenlijst!$C$566:$N$570,12,FALSE),\"\"))","v":""}]
[{"$f":"IF(Partners!C78=\"\",\"\",$A$2)","v":""},{"$f":"IF(Partners!C78=\"\",\"\",$B$6)","v":""},{"$f":"IF(Partners!C78=\"\",\"\",$C$6)","v":""},{"$f":"IF(Partners!C78=\"\",\"\",Partners!C78)","v":""},{"$f":"IF(Partners!C78=\"\",\"\",CONCATENATE(A82,\"000\",Partners!B78))","v":""},null,null,{"$f":"IF(OR(F82=2,G82=2),D82,\"\")","v":""},{"$f":"IFERROR(VLOOKUP(D82,Vragenlijst!$AY$236:$BA$245,3,FALSE),\"\")","v":""},{"$f":"IF(AND(D82<>\"\",D82<>0),IFERROR(VLOOKUP(D82,Vragenlijst!$C$451:$R$460,16,FALSE),\"nee\"),\"\")","v":""},{"$f":"IF(OR(F82=4,G82=4),D82,\"\")","v":""},{"$f":"IFERROR(VLOOKUP(K82,Vragenlijst!$AY$465:$BA$477,3,FALSE),\"\")","v":""},{"$f":"IFERROR(VLOOKUP(K82,Vragenlijst!$AY$482:$BB$494,4,FALSE),\"\")","v":""},{"$f":"IF(OR(D82=0,D82=\"\"),\"\",IFERROR(VLOOKUP(D82,Vragenlijst!$C$566:$K$570,9,FALSE),\"\"))","v":""},{"$f":"IF(OR(D82=0,D82=\"\"),\"\",IFERROR(VLOOKUP(D82,Vragenlijst!$C$566:$N$570,12,FALSE),\"\"))","v":""}]
[{"$f":"IF(Partners!C79=\"\",\"\",$A$2)","v":""},{"$f":"IF(Partners!C79=\"\",\"\",$B$6)","v":""},{"$f":"IF(Partners!C79=\"\",\"\",$C$6)","v":""},{"$f":"IF(Partners!C79=\"\",\"\",Partners!C79)","v":""},{"$f":"IF(Partners!C79=\"\",\"\",CONCATENATE(A83,\"000\",Partners!B79))","v":""},null,null,"",{"$f":"IFERROR(VLOOKUP(D83,Vragenlijst!$AY$236:$BA$245,3,FALSE),\"\")","v":""},{"$f":"IF(AND(D83<>\"\",D83<>0),IFERROR(VLOOKUP(D83,Vragenlijst!$C$451:$R$460,16,FALSE),\"nee\"),\"\")","v":""},"",{"$f":"IFERROR(VLOOKUP(K83,Vragenlijst!$AY$465:$BA$477,3,FALSE),\"\")","v":""},{"$f":"IFERROR(VLOOKUP(K83,Vragenlijst!$AY$482:$BB$494,4,FALSE),\"\")","v":""},{"$f":"IF(OR(D83=0,D83=\"\"),\"\",IFERROR(VLOOKUP(D83,Vragenlijst!$C$566:$K$570,9,FALSE),\"\"))","v":""},{"$f":"IF(OR(D83=0,D83=\"\"),\"\",IFERROR(VLOOKUP(D83,Vragenlijst!$C$566:$N$570,12,FALSE),\"\"))","v":""}]
[{"$f":"IF(Partners!C80=\"\",\"\",$A$2)","v":""},{"$f":"IF(Partners!C80=\"\",\"\",$B$6)","v":""},{"$f":"IF(Partners!C80=\"\",\"\",$C$6)","v":""},{"$f":"IF(Partners!C80=\"\",\"\",Partners!C80)","v":""},{"$f":"IF(Partners!C80=\"\",\"\",CONCATENATE(A84,\"000\",Partners!B80))","v":""},null,null,"",{"$f":"IFERROR(VLOOKUP(D84,Vragenlijst!$AY$236:$BA$245,3,FALSE),\"\")","v":""},{"$f":"IF(AND(D84<>\"\",D84<>0),IFERROR(VLOOKUP(D84,Vragenlijst!$C$451:$R$460,16,FALSE),\"nee\"),\"\")","v":""},"",{"$f":"IFERROR(VLOOKUP(K84,Vragenlijst!$AY$465:$BA$477,3,FALSE),\"\")","v":""},{"$f":"IFERROR(VLOOKUP(K84,Vragenlijst!$AY$482:$BB$494,4,FALSE),\"\")","v":""},{"$f":"IF(OR(D84=0,D84=\"\"),\"\",IFERROR(VLOOKUP(D84,Vragenlijst!$C$566:$K$570,9,FALSE),\"\"))","v":""},{"$f":"IF(OR(D84=0,D84=\"\"),\"\",IFERROR(VLOOKUP(D84,Vragenlijst!$C$566:$N$570,12,FALSE),\"\"))","v":""}]
[{"$f":"IF(Partners!C81=\"\",\"\",$A$2)","v":""},{"$f":"IF(Partners!C81=\"\",\"\",$B$6)","v":""},{"$f":"IF(Partners!C81=\"\",\"\",$C$6)","v":""},{"$f":"IF(Partners!C81=\"\",\"\",Partners!C81)","v":""},{"$f":"IF(Partners!C81=\"\",\"\",CONCATENATE(A85,\"000\",Partners!B81))","v":""},null,null,"",{"$f":"IFERROR(VLOOKUP(D85,Vragenlijst!$AY$236:$BA$245,3,FALSE),\"\")","v":""},{"$f":"IF(AND(D85<>\"\",D85<>0),IFERROR(VLOOKUP(D85,Vragenlijst!$C$451:$R$460,16,FALSE),\"nee\"),\"\")","v":""},"",{"$f":"IFERROR(VLOOKUP(K85,Vragenlijst!$AY$465:$BA$477,3,FALSE),\"\")","v":""},{"$f":"IFERROR(VLOOKUP(K85,Vragenlijst!$AY$482:$BB$494,4,FALSE),\"\")","v":""},{"$f":"IF(OR(D85=0,D85=\"\"),\"\",IFERROR(VLOOKUP(D85,Vragenlijst!$C$566:$K$570,9,FALSE),\"\"))","v":""},{"$f":"IF(OR(D85=0,D85=\"\"),\"\",IFERROR(VLOOKUP(D85,Vragenlijst!$C$566:$N$570,12,FALSE),\"\"))","v":""}]
[{"$f":"IF(Partners!C82=\"\",\"\",$A$2)","v":""},{"$f":"IF(Partners!C82=\"\",\"\",$B$6)","v":""},{"$f":"IF(Partners!C82=\"\",\"\",$C$6)","v":""},{"$f":"IF(Partners!C82=\"\",\"\",Partners!C82)","v":""},{"$f":"IF(Partners!C82=\"\",\"\",CONCATENATE(A86,\"000\",Partners!B82))","v":""},null,null,"",{"$f":"IFERROR(VLOOKUP(D86,Vragenlijst!$AY$236:$BA$245,3,FALSE),\"\")","v":""},{"$f":"IF(AND(D86<>\"\",D86<>0),IFERROR(VLOOKUP(D86,Vragenlijst!$C$451:$R$460,16,FALSE),\"nee\"),\"\")","v":""},"",{"$f":"IFERROR(VLOOKUP(K86,Vragenlijst!$AY$465:$BA$477,3,FALSE),\"\")","v":""},{"$f":"IFERROR(VLOOKUP(K86,Vragenlijst!$AY$482:$BB$494,4,FALSE),\"\")","v":""},{"$f":"IF(OR(D86=0,D86=\"\"),\"\",IFERROR(VLOOKUP(D86,Vragenlijst!$C$566:$K$570,9,FALSE),\"\"))","v":""},{"$f":"IF(OR(D86=0,D86=\"\"),\"\",IFERROR(VLOOKUP(D86,Vragenlijst!$C$566:$N$570,12,FALSE),\"\"))","v":""}]
[{"$f":"IF(Partners!C83=\"\",\"\",$A$2)","v":""},{"$f":"IF(Partners!C83=\"\",\"\",$B$6)","v":""},{"$f":"IF(Partners!C83=\"\",\"\",$C$6)","v":""},{"$f":"IF(Partners!C83=\"\",\"\",Partners!C83)","v":""},{"$f":"IF(Partners!C83=\"\",\"\",CONCATENATE(A87,\"000\",Partners!B83))","v":""},null,null,"",{"$f":"IFERROR(VLOOKUP(D87,Vragenlijst!$AY$236:$BA$245,3,FALSE),\"\")","v":""},{"$f":"IF(AND(D87<>\"\",D87<>0),IFERROR(VLOOKUP(D87,Vragenlijst!$C$451:$R$460,16,FALSE),\"nee\"),\"\")","v":""},"",{"$f":"IFERROR(VLOOKUP(K87,Vragenlijst!$AY$465:$BA$477,3,FALSE),\"\")","v":""},{"$f":"IFERROR(VLOOKUP(K87,Vragenlijst!$AY$482:$BB$494,4,FALSE),\"\")","v":""},{"$f":"IF(OR(D87=0,D87=\"\"),\"\",IFERROR(VLOOKUP(D87,Vragenlijst!$C$566:$K$570,9,FALSE),\"\"))","v":""},{"$f":"IF(OR(D87=0,D87=\"\"),\"\",IFERROR(VLOOKUP(D87,Vragenlijst!$C$566:$N$570,12,FALSE),\"\"))","v":""}]
[{"$f":"IF(Partners!C84=\"\",\"\",$A$2)","v":""},{"$f":"IF(Partners!C84=\"\",\"\",$B$6)","v":""},{"$f":"IF(Partners!C84=\"\",\"\",$C$6)","v":""},{"$f":"IF(Partners!C84=\"\",\"\",Partners!C84)","v":""},{"$f":"IF(Partners!C84=\"\",\"\",CONCATENATE(A88,\"000\",Partners!B84))","v":""},null,null,"",{"$f":"IFERROR(VLOOKUP(D88,Vragenlijst!$AY$236:$BA$245,3,FALSE),\"\")","v":""},{"$f":"IF(AND(D88<>\"\",D88<>0),IFERROR(VLOOKUP(D88,Vragenlijst!$C$451:$R$460,16,FALSE),\"nee\"),\"\")","v":""},"",{"$f":"IFERROR(VLOOKUP(K88,Vragenlijst!$AY$465:$BA$477,3,FALSE),\"\")","v":""},{"$f":"IFERROR(VLOOKUP(K88,Vragenlijst!$AY$482:$BB$494,4,FALSE),\"\")","v":""},{"$f":"IF(OR(D88=0,D88=\"\"),\"\",IFERROR(VLOOKUP(D88,Vragenlijst!$C$566:$K$570,9,FALSE),\"\"))","v":""},{"$f":"IF(OR(D88=0,D88=\"\"),\"\",IFERROR(VLOOKUP(D88,Vragenlijst!$C$566:$N$570,12,FALSE),\"\"))","v":""}]
[{"$f":"IF(Partners!C85=\"\",\"\",$A$2)","v":""},{"$f":"IF(Partners!C85=\"\",\"\",$B$6)","v":""},{"$f":"IF(Partners!C85=\"\",\"\",$C$6)","v":""},{"$f":"IF(Partners!C85=\"\",\"\",Partners!C85)","v":""},{"$f":"IF(Partners!C85=\"\",\"\",CONCATENATE(A89,\"000\",Partners!B85))","v":""},null,null,"",{"$f":"IFERROR(VLOOKUP(D89,Vragenlijst!$AY$236:$BA$245,3,FALSE),\"\")","v":""},{"$f":"IF(AND(D89<>\"\",D89<>0),IFERROR(VLOOKUP(D89,Vragenlijst!$C$451:$R$460,16,FALSE),\"nee\"),\"\")","v":""},"",{"$f":"IFERROR(VLOOKUP(K89,Vragenlijst!$AY$465:$BA$477,3,FALSE),\"\")","v":""},{"$f":"IFERROR(VLOOKUP(K89,Vragenlijst!$AY$482:$BB$494,4,FALSE),\"\")","v":""},{"$f":"IF(OR(D89=0,D89=\"\"),\"\",IFERROR(VLOOKUP(D89,Vragenlijst!$C$566:$K$570,9,FALSE),\"\"))","v":""},{"$f":"IF(OR(D89=0,D89=\"\"),\"\",IFERROR(VLOOKUP(D89,Vragenlijst!$C$566:$N$570,12,FALSE),\"\"))","v":""}]
[{"$f":"IF(Partners!C86=\"\",\"\",$A$2)","v":""},{"$f":"IF(Partners!C86=\"\",\"\",$B$6)","v":""},{"$f":"IF(Partners!C86=\"\",\"\",$C$6)","v":""},{"$f":"IF(Partners!C86=\"\",\"\",Partners!C86)","v":""},{"$f":"IF(Partners!C86=\"\",\"\",CONCATENATE(A90,\"000\",Partners!B86))","v":""},null,null,"",{"$f":"IFERROR(VLOOKUP(D90,Vragenlijst!$AY$236:$BA$245,3,FALSE),\"\")","v":""},{"$f":"IF(AND(D90<>\"\",D90<>0),IFERROR(VLOOKUP(D90,Vragenlijst!$C$451:$R$460,16,FALSE),\"nee\"),\"\")","v":""},"",{"$f":"IFERROR(VLOOKUP(K90,Vragenlijst!$AY$465:$BA$477,3,FALSE),\"\")","v":""},{"$f":"IFERROR(VLOOKUP(K90,Vragenlijst!$AY$482:$BB$494,4,FALSE),\"\")","v":""},{"$f":"IF(OR(D90=0,D90=\"\"),\"\",IFERROR(VLOOKUP(D90,Vragenlijst!$C$566:$K$570,9,FALSE),\"\"))","v":""},{"$f":"IF(OR(D90=0,D90=\"\"),\"\",IFERROR(VLOOKUP(D90,Vragenlijst!$C$566:$N$570,12,FALSE),\"\"))","v":""}]
[{"$f":"IF(Partners!C87=\"\",\"\",$A$2)","v":""},{"$f":"IF(Partners!C87=\"\",\"\",$B$6)","v":""},{"$f":"IF(Partners!C87=\"\",\"\",$C$6)","v":""},{"$f":"IF(Partners!C87=\"\",\"\",Partners!C87)","v":""},{"$f":"IF(Partners!C87=\"\",\"\",CONCATENATE(A91,\"000\",Partners!B87))","v":""},null,null,"",{"$f":"IFERROR(VLOOKUP(D91,Vragenlijst!$AY$236:$BA$245,3,FALSE),\"\")","v":""},{"$f":"IF(AND(D91<>\"\",D91<>0),IFERROR(VLOOKUP(D91,Vragenlijst!$C$451:$R$460,16,FALSE),\"nee\"),\"\")","v":""},"",{"$f":"IFERROR(VLOOKUP(K91,Vragenlijst!$AY$465:$BA$477,3,FALSE),\"\")","v":""},{"$f":"IFERROR(VLOOKUP(K91,Vragenlijst!$AY$482:$BB$494,4,FALSE),\"\")","v":""},{"$f":"IF(OR(D91=0,D91=\"\"),\"\",IFERROR(VLOOKUP(D91,Vragenlijst!$C$566:$K$570,9,FALSE),\"\"))","v":""},{"$f":"IF(OR(D91=0,D91=\"\"),\"\",IFERROR(VLOOKUP(D91,Vragenlijst!$C$566:$N$570,12,FALSE),\"\"))","v":""}]
[{"$f":"IF(Partners!C88=\"\",\"\",$A$2)","v":""},{"$f":"IF(Partners!C88=\"\",\"\",$B$6)","v":""},{"$f":"IF(Partners!C88=\"\",\"\",$C$6)","v":""},{"$f":"IF(Partners!C88=\"\",\"\",Partners!C88)","v":""},{"$f":"IF(Partners!C88=\"\",\"\",CONCATENATE(A92,\"000\",Partners!B88))","v":""},null,null,"",{"$f":"IFERROR(VLOOKUP(D92,Vragenlijst!$AY$236:$BA$245,3,FALSE),\"\")","v":""},{"$f":"IF(AND(D92<>\"\",D92<>0),IFERROR(VLOOKUP(D92,Vragenlijst!$C$451:$R$460,16,FALSE),\"nee\"),\"\")","v":""},"",{"$f":"IFERROR(VLOOKUP(K92,Vragenlijst!$AY$465:$BA$477,3,FALSE),\"\")","v":""},{"$f":"IFERROR(VLOOKUP(K92,Vragenlijst!$AY$482:$BB$494,4,FALSE),\"\")","v":""},{"$f":"IF(OR(D92=0,D92=\"\"),\"\",IFERROR(VLOOKUP(D92,Vragenlijst!$C$566:$K$570,9,FALSE),\"\"))","v":""},{"$f":"IF(OR(D92=0,D92=\"\"),\"\",IFERROR(VLOOKUP(D92,Vragenlijst!$C$566:$N$570,12,FALSE),\"\"))","v":""}]
[{"$f":"IF(Partners!C89=\"\",\"\",$A$2)","v":""},{"$f":"IF(Partners!C89=\"\",\"\",$B$6)","v":""},{"$f":"IF(Partners!C89=\"\",\"\",$C$6)","v":""},{"$f":"IF(Partners!C89=\"\",\"\",Partners!C89)","v":""},{"$f":"IF(Partners!C89=\"\",\"\",CONCATENATE(A93,\"000\",Partners!B89))","v":""},null,null,"",{"$f":"IFERROR(VLOOKUP(D93,Vragenlijst!$AY$236:$BA$245,3,FALSE),\"\")","v":""},{"$f":"IF(AND(D93<>\"\",D93<>0),IFERROR(VLOOKUP(D93,Vragenlijst!$C$451:$R$460,16,FALSE),\"nee\"),\"\")","v":""},"",{"$f":"IFERROR(VLOOKUP(K93,Vragenlijst!$AY$465:$BA$477,3,FALSE),\"\")","v":""},{"$f":"IFERROR(VLOOKUP(K93,Vragenlijst!$AY$482:$BB$494,4,FALSE),\"\")","v":""},{"$f":"IF(OR(D93=0,D93=\"\"),\"\",IFERROR(VLOOKUP(D93,Vragenlijst!$C$566:$K$570,9,FALSE),\"\"))","v":""},{"$f":"IF(OR(D93=0,D93=\"\"),\"\",IFERROR(VLOOKUP(D93,Vragenlijst!$C$566:$N$570,12,FALSE),\"\"))","v":""}]
[{"$f":"IF(Partners!C90=\"\",\"\",$A$2)","v":""},{"$f":"IF(Partners!C90=\"\",\"\",$B$6)","v":""},{"$f":"IF(Partners!C90=\"\",\"\",$C$6)","v":""},{"$f":"IF(Partners!C90=\"\",\"\",Partners!C90)","v":""},{"$f":"IF(Partners!C90=\"\",\"\",CONCATENATE(A94,\"000\",Partners!B90))","v":""},null,null,"",{"$f":"IFERROR(VLOOKUP(D94,Vragenlijst!$AY$236:$BA$245,3,FALSE),\"\")","v":""},{"$f":"IF(AND(D94<>\"\",D94<>0),IFERROR(VLOOKUP(D94,Vragenlijst!$C$451:$R$460,16,FALSE),\"nee\"),\"\")","v":""},"",{"$f":"IFERROR(VLOOKUP(K94,Vragenlijst!$AY$465:$BA$477,3,FALSE),\"\")","v":""},{"$f":"IFERROR(VLOOKUP(K94,Vragenlijst!$AY$482:$BB$494,4,FALSE),\"\")","v":""},{"$f":"IF(OR(D94=0,D94=\"\"),\"\",IFERROR(VLOOKUP(D94,Vragenlijst!$C$566:$K$570,9,FALSE),\"\"))","v":""},{"$f":"IF(OR(D94=0,D94=\"\"),\"\",IFERROR(VLOOKUP(D94,Vragenlijst!$C$566:$N$570,12,FALSE),\"\"))","v":""}]
[{"$f":"IF(Partners!C91=\"\",\"\",$A$2)","v":""},{"$f":"IF(Partners!C91=\"\",\"\",$B$6)","v":""},{"$f":"IF(Partners!C91=\"\",\"\",$C$6)","v":""},{"$f":"IF(Partners!C91=\"\",\"\",Partners!C91)","v":""},{"$f":"IF(Partners!C91=\"\",\"\",CONCATENATE(A95,\"000\",Partners!B91))","v":""},null,null,"",{"$f":"IFERROR(VLOOKUP(D95,Vragenlijst!$AY$236:$BA$245,3,FALSE),\"\")","v":""},{"$f":"IF(AND(D95<>\"\",D95<>0),IFERROR(VLOOKUP(D95,Vragenlijst!$C$451:$R$460,16,FALSE),\"nee\"),\"\")","v":""},"",{"$f":"IFERROR(VLOOKUP(K95,Vragenlijst!$AY$465:$BA$477,3,FALSE),\"\")","v":""},{"$f":"IFERROR(VLOOKUP(K95,Vragenlijst!$AY$482:$BB$494,4,FALSE),\"\")","v":""},{"$f":"IF(OR(D95=0,D95=\"\"),\"\",IFERROR(VLOOKUP(D95,Vragenlijst!$C$566:$K$570,9,FALSE),\"\"))","v":""},{"$f":"IF(OR(D95=0,D95=\"\"),\"\",IFERROR(VLOOKUP(D95,Vragenlijst!$C$566:$N$570,12,FALSE),\"\"))","v":""}]
[{"$f":"IF(Partners!C92=\"\",\"\",$A$2)","v":""},{"$f":"IF(Partners!C92=\"\",\"\",$B$6)","v":""},{"$f":"IF(Partners!C92=\"\",\"\",$C$6)","v":""},{"$f":"IF(Partners!C92=\"\",\"\",Partners!C92)","v":""},{"$f":"IF(Partners!C92=\"\",\"\",CONCATENATE(A96,\"000\",Partners!B92))","v":""},null,null,"",{"$f":"IFERROR(VLOOKUP(D96,Vragenlijst!$AY$236:$BA$245,3,FALSE),\"\")","v":""},{"$f":"IF(AND(D96<>\"\",D96<>0),IFERROR(VLOOKUP(D96,Vragenlijst!$C$451:$R$460,16,FALSE),\"nee\"),\"\")","v":""},"",{"$f":"IFERROR(VLOOKUP(K96,Vragenlijst!$AY$465:$BA$477,3,FALSE),\"\")","v":""},{"$f":"IFERROR(VLOOKUP(K96,Vragenlijst!$AY$482:$BB$494,4,FALSE),\"\")","v":""},{"$f":"IF(OR(D96=0,D96=\"\"),\"\",IFERROR(VLOOKUP(D96,Vragenlijst!$C$566:$K$570,9,FALSE),\"\"))","v":""},{"$f":"IF(OR(D96=0,D96=\"\"),\"\",IFERROR(VLOOKUP(D96,Vragenlijst!$C$566:$N$570,12,FALSE),\"\"))","v":""}]
[{"$f":"IF(Partners!C93=\"\",\"\",$A$2)","v":""},{"$f":"IF(Partners!C93=\"\",\"\",$B$6)","v":""},{"$f":"IF(Partners!C93=\"\",\"\",$C$6)","v":""},{"$f":"IF(Partners!C93=\"\",\"\",Partners!C93)","v":""},{"$f":"IF(Partners!C93=\"\",\"\",CONCATENATE(A97,\"000\",Partners!B93))","v":""},null,null,"",{"$f":"IFERROR(VLOOKUP(D97,Vragenlijst!$AY$236:$BA$245,3,FALSE),\"\")","v":""},{"$f":"IF(AND(D97<>\"\",D97<>0),IFERROR(VLOOKUP(D97,Vragenlijst!$C$451:$R$460,16,FALSE),\"nee\"),\"\")","v":""},"",{"$f":"IFERROR(VLOOKUP(K97,Vragenlijst!$AY$465:$BA$477,3,FALSE),\"\")","v":""},{"$f":"IFERROR(VLOOKUP(K97,Vragenlijst!$AY$482:$BB$494,4,FALSE),\"\")","v":""},{"$f":"IF(OR(D97=0,D97=\"\"),\"\",IFERROR(VLOOKUP(D97,Vragenlijst!$C$566:$K$570,9,FALSE),\"\"))","v":""},{"$f":"IF(OR(D97=0,D97=\"\"),\"\",IFERROR(VLOOKUP(D97,Vragenlijst!$C$566:$N$570,12,FALSE),\"\"))","v":""}]
[{"$f":"IF(Partners!C94=\"\",\"\",$A$2)","v":""},{"$f":"IF(Partners!C94=\"\",\"\",$B$6)","v":""},{"$f":"IF(Partners!C94=\"\",\"\",$C$6)","v":""},{"$f":"IF(Partners!C94=\"\",\"\",Partners!C94)","v":""},{"$f":"IF(Partners!C94=\"\",\"\",CONCATENATE(A98,\"000\",Partners!B94))","v":""},null,null,"",{"$f":"IFERROR(VLOOKUP(D98,Vragenlijst!$AY$236:$BA$245,3,FALSE),\"\")","v":""},{"$f":"IF(AND(D98<>\"\",D98<>0),IFERROR(VLOOKUP(D98,Vragenlijst!$C$451:$R$460,16,FALSE),\"nee\"),\"\")","v":""},"",{"$f":"IFERROR(VLOOKUP(K98,Vragenlijst!$AY$465:$BA$477,3,FALSE),\"\")","v":""},{"$f":"IFERROR(VLOOKUP(K98,Vragenlijst!$AY$482:$BB$494,4,FALSE),\"\")","v":""},{"$f":"IF(OR(D98=0,D98=\"\"),\"\",IFERROR(VLOOKUP(D98,Vragenlijst!$C$566:$K$570,9,FALSE),\"\"))","v":""},{"$f":"IF(OR(D98=0,D98=\"\"),\"\",IFERROR(VLOOKUP(D98,Vragenlijst!$C$566:$N$570,12,FALSE),\"\"))","v":""}]
[{"$f":"IF(Partners!C95=\"\",\"\",$A$2)","v":""},{"$f":"IF(Partners!C95=\"\",\"\",$B$6)","v":""},{"$f":"IF(Partners!C95=\"\",\"\",$C$6)","v":""},{"$f":"IF(Partners!C95=\"\",\"\",Partners!C95)","v":""},{"$f":"IF(Partners!C95=\"\",\"\",CONCATENATE(A99,\"000\",Partners!B95))","v":""},null,null,"",{"$f":"IFERROR(VLOOKUP(D99,Vragenlijst!$AY$236:$BA$245,3,FALSE),\"\")","v":""},{"$f":"IF(AND(D99<>\"\",D99<>0),IFERROR(VLOOKUP(D99,Vragenlijst!$C$451:$R$460,16,FALSE),\"nee\"),\"\")","v":""},"",{"$f":"IFERROR(VLOOKUP(K99,Vragenlijst!$AY$465:$BA$477,3,FALSE),\"\")","v":""},{"$f":"IFERROR(VLOOKUP(K99,Vragenlijst!$AY$482:$BB$494,4,FALSE),\"\")","v":""},{"$f":"IF(OR(D99=0,D99=\"\"),\"\",IFERROR(VLOOKUP(D99,Vragenlijst!$C$566:$K$570,9,FALSE),\"\"))","v":""},{"$f":"IF(OR(D99=0,D99=\"\"),\"\",IFERROR(VLOOKUP(D99,Vragenlijst!$C$566:$N$570,12,FALSE),\"\"))","v":""}]
[{"$f":"IF(Partners!C96=\"\",\"\",$A$2)","v":""},{"$f":"IF(Partners!C96=\"\",\"\",$B$6)","v":""},{"$f":"IF(Partners!C96=\"\",\"\",$C$6)","v":""},{"$f":"IF(Partners!C96=\"\",\"\",Partners!C96)","v":""},{"$f":"IF(Partners!C96=\"\",\"\",CONCATENATE(A100,\"000\",Partners!B96))","v":""},null,null,"",{"$f":"IFERROR(VLOOKUP(D100,Vragenlijst!$AY$236:$BA$245,3,FALSE),\"\")","v":""},{"$f":"IF(AND(D100<>\"\",D100<>0),IFERROR(VLOOKUP(D100,Vragenlijst!$C$451:$R$460,16,FALSE),\"nee\"),\"\")","v":""},"",{"$f":"IFERROR(VLOOKUP(K100,Vragenlijst!$AY$465:$BA$477,3,FALSE),\"\")","v":""},{"$f":"IFERROR(VLOOKUP(K100,Vragenlijst!$AY$482:$BB$494,4,FALSE),\"\")","v":""},{"$f":"IF(OR(D100=0,D100=\"\"),\"\",IFERROR(VLOOKUP(D100,Vragenlijst!$C$566:$K$570,9,FALSE),\"\"))","v":""},{"$f":"IF(OR(D100=0,D100=\"\"),\"\",IFERROR(VLOOKUP(D100,Vragenlijst!$C$566:$N$570,12,FALSE),\"\"))","v":""}]
[{"$f":"IF(Partners!C97=\"\",\"\",$A$2)","v":""},{"$f":"IF(Partners!C97=\"\",\"\",$B$6)","v":""},{"$f":"IF(Partners!C97=\"\",\"\",$C$6)","v":""},{"$f":"IF(Partners!C97=\"\",\"\",Partners!C97)","v":""},{"$f":"IF(Partners!C97=\"\",\"\",CONCATENATE(A101,\"000\",Partners!B97))","v":""},null,null,"",{"$f":"IFERROR(VLOOKUP(D101,Vragenlijst!$AY$236:$BA$245,3,FALSE),\"\")","v":""},{"$f":"IF(AND(D101<>\"\",D101<>0),IFERROR(VLOOKUP(D101,Vragenlijst!$C$451:$R$460,16,FALSE),\"nee\"),\"\")","v":""},"",{"$f":"IFERROR(VLOOKUP(K101,Vragenlijst!$AY$465:$BA$477,3,FALSE),\"\")","v":""},{"$f":"IFERROR(VLOOKUP(K101,Vragenlijst!$AY$482:$BB$494,4,FALSE),\"\")","v":""},{"$f":"IF(OR(D101=0,D101=\"\"),\"\",IFERROR(VLOOKUP(D101,Vragenlijst!$C$566:$K$570,9,FALSE),\"\"))","v":""},{"$f":"IF(OR(D101=0,D101=\"\"),\"\",IFERROR(VLOOKUP(D101,Vragenlijst!$C$566:$N$570,12,FALSE),\"\"))","v":""}]
[{"$f":"IF(Partners!C98=\"\",\"\",$A$2)","v":""},{"$f":"IF(Partners!C98=\"\",\"\",$B$6)","v":""},{"$f":"IF(Partners!C98=\"\",\"\",$C$6)","v":""},{"$f":"IF(Partners!C98=\"\",\"\",Partners!C98)","v":""},{"$f":"IF(Partners!C98=\"\",\"\",CONCATENATE(A102,\"000\",Partners!B98))","v":""},null,null,"",{"$f":"IFERROR(VLOOKUP(D102,Vragenlijst!$AY$236:$BA$245,3,FALSE),\"\")","v":""},{"$f":"IF(AND(D102<>\"\",D102<>0),IFERROR(VLOOKUP(D102,Vragenlijst!$C$451:$R$460,16,FALSE),\"nee\"),\"\")","v":""},"",{"$f":"IFERROR(VLOOKUP(K102,Vragenlijst!$AY$465:$BA$477,3,FALSE),\"\")","v":""},{"$f":"IFERROR(VLOOKUP(K102,Vragenlijst!$AY$482:$BB$494,4,FALSE),\"\")","v":""},{"$f":"IF(OR(D102=0,D102=\"\"),\"\",IFERROR(VLOOKUP(D102,Vragenlijst!$C$566:$K$570,9,FALSE),\"\"))","v":""},{"$f":"IF(OR(D102=0,D102=\"\"),\"\",IFERROR(VLOOKUP(D102,Vragenlijst!$C$566:$N$570,12,FALSE),\"\"))","v":""}]
[{"$f":"IF(Partners!C99=\"\",\"\",$A$2)","v":""},{"$f":"IF(Partners!C99=\"\",\"\",$B$6)","v":""},{"$f":"IF(Partners!C99=\"\",\"\",$C$6)","v":""},{"$f":"IF(Partners!C99=\"\",\"\",Partners!C99)","v":""},{"$f":"IF(Partners!C99=\"\",\"\",CONCATENATE(A103,\"000\",Partners!B99))","v":""},null,null,"",{"$f":"IFERROR(VLOOKUP(D103,Vragenlijst!$AY$236:$BA$245,3,FALSE),\"\")","v":""},{"$f":"IF(AND(D103<>\"\",D103<>0),IFERROR(VLOOKUP(D103,Vragenlijst!$C$451:$R$460,16,FALSE),\"nee\"),\"\")","v":""},"",{"$f":"IFERROR(VLOOKUP(K103,Vragenlijst!$AY$465:$BA$477,3,FALSE),\"\")","v":""},{"$f":"IFERROR(VLOOKUP(K103,Vragenlijst!$AY$482:$BB$494,4,FALSE),\"\")","v":""},{"$f":"IF(OR(D103=0,D103=\"\"),\"\",IFERROR(VLOOKUP(D103,Vragenlijst!$C$566:$K$570,9,FALSE),\"\"))","v":""},{"$f":"IF(OR(D103=0,D103=\"\"),\"\",IFERROR(VLOOKUP(D103,Vragenlijst!$C$566:$N$570,12,FALSE),\"\"))","v":""}]
[{"$f":"IF(Partners!C100=\"\",\"\",$A$2)","v":""},{"$f":"IF(Partners!C100=\"\",\"\",$B$6)","v":""},{"$f":"IF(Partners!C100=\"\",\"\",$C$6)","v":""},{"$f":"IF(Partners!C100=\"\",\"\",Partners!C100)","v":""},{"$f":"IF(Partners!C100=\"\",\"\",CONCATENATE(A104,\"000\",Partners!B100))","v":""},null,null,"",{"$f":"IFERROR(VLOOKUP(D104,Vragenlijst!$AY$236:$BA$245,3,FALSE),\"\")","v":""},{"$f":"IF(AND(D104<>\"\",D104<>0),IFERROR(VLOOKUP(D104,Vragenlijst!$C$451:$R$460,16,FALSE),\"nee\"),\"\")","v":""},"",{"$f":"IFERROR(VLOOKUP(K104,Vragenlijst!$AY$465:$BA$477,3,FALSE),\"\")","v":""},{"$f":"IFERROR(VLOOKUP(K104,Vragenlijst!$AY$482:$BB$494,4,FALSE),\"\")","v":""},{"$f":"IF(OR(D104=0,D104=\"\"),\"\",IFERROR(VLOOKUP(D104,Vragenlijst!$C$566:$K$570,9,FALSE),\"\"))","v":""},{"$f":"IF(OR(D104=0,D104=\"\"),\"\",IFERROR(VLOOKUP(D104,Vragenlijst!$C$566:$N$570,12,FALSE),\"\"))","v":""}]
[{"$f":"IF(Partners!C101=\"\",\"\",$A$2)","v":""},{"$f":"IF(Partners!C101=\"\",\"\",$B$6)","v":""},{"$f":"IF(Partners!C101=\"\",\"\",$C$6)","v":""},{"$f":"IF(Partners!C101=\"\",\"\",Partners!C101)","v":""},{"$f":"IF(Partners!C101=\"\",\"\",CONCATENATE(A105,\"000\",Partners!B101))","v":""},null,null,"",{"$f":"IFERROR(VLOOKUP(D105,Vragenlijst!$AY$236:$BA$245,3,FALSE),\"\")","v":""},{"$f":"IF(AND(D105<>\"\",D105<>0),IFERROR(VLOOKUP(D105,Vragenlijst!$C$451:$R$460,16,FALSE),\"nee\"),\"\")","v":""},"",{"$f":"IFERROR(VLOOKUP(K105,Vragenlijst!$AY$465:$BA$477,3,FALSE),\"\")","v":""},{"$f":"IFERROR(VLOOKUP(K105,Vragenlijst!$AY$482:$BB$494,4,FALSE),\"\")","v":""},{"$f":"IF(OR(D105=0,D105=\"\"),\"\",IFERROR(VLOOKUP(D105,Vragenlijst!$C$566:$K$570,9,FALSE),\"\"))","v":""},{"$f":"IF(OR(D105=0,D105=\"\"),\"\",IFERROR(VLOOKUP(D105,Vragenlijst!$C$566:$N$570,12,FALSE),\"\"))","v":""}]
[{"$f":"IF(Partners!C102=\"\",\"\",$A$2)","v":""},{"$f":"IF(Partners!C102=\"\",\"\",$B$6)","v":""},{"$f":"IF(Partners!C102=\"\",\"\",$C$6)","v":""},{"$f":"IF(Partners!C102=\"\",\"\",Partners!C102)","v":""},{"$f":"IF(Partners!C102=\"\",\"\",CONCATENATE(A106,\"000\",Partners!B102))","v":""},null,null,"",{"$f":"IFERROR(VLOOKUP(D106,Vragenlijst!$AY$236:$BA$245,3,FALSE),\"\")","v":""},{"$f":"IF(AND(D106<>\"\",D106<>0),IFERROR(VLOOKUP(D106,Vragenlijst!$C$451:$R$460,16,FALSE),\"nee\"),\"\")","v":""},"",{"$f":"IFERROR(VLOOKUP(K106,Vragenlijst!$AY$465:$BA$477,3,FALSE),\"\")","v":""},{"$f":"IFERROR(VLOOKUP(K106,Vragenlijst!$AY$482:$BB$494,4,FALSE),\"\")","v":""},{"$f":"IF(OR(D106=0,D106=\"\"),\"\",IFERROR(VLOOKUP(D106,Vragenlijst!$C$566:$K$570,9,FALSE),\"\"))","v":""},{"$f":"IF(OR(D106=0,D106=\"\"),\"\",IFERROR(VLOOKUP(D106,Vragenlijst!$C$566:$N$570,12,FALSE),\"\"))","v":""}]
[{"$f":"IF(Partners!C103=\"\",\"\",$A$2)","v":""},{"$f":"IF(Partners!C103=\"\",\"\",$B$6)","v":""},{"$f":"IF(Partners!C103=\"\",\"\",$C$6)","v":""},{"$f":"IF(Partners!C103=\"\",\"\",Partners!C103)","v":""},{"$f":"IF(Partners!C103=\"\",\"\",CONCATENATE(A107,\"000\",Partners!B103))","v":""},null,null,"",{"$f":"IFERROR(VLOOKUP(D107,Vragenlijst!$AY$236:$BA$245,3,FALSE),\"\")","v":""},{"$f":"IF(AND(D107<>\"\",D107<>0),IFERROR(VLOOKUP(D107,Vragenlijst!$C$451:$R$460,16,FALSE),\"nee\"),\"\")","v":""},"",{"$f":"IFERROR(VLOOKUP(K107,Vragenlijst!$AY$465:$BA$477,3,FALSE),\"\")","v":""},{"$f":"IFERROR(VLOOKUP(K107,Vragenlijst!$AY$482:$BB$494,4,FALSE),\"\")","v":""},{"$f":"IF(OR(D107=0,D107=\"\"),\"\",IFERROR(VLOOKUP(D107,Vragenlijst!$C$566:$K$570,9,FALSE),\"\"))","v":""},{"$f":"IF(OR(D107=0,D107=\"\"),\"\",IFERROR(VLOOKUP(D107,Vragenlijst!$C$566:$N$570,12,FALSE),\"\"))","v":""}]
[{"$f":"IF(Partners!C104=\"\",\"\",$A$2)","v":""},{"$f":"IF(Partners!C104=\"\",\"\",$B$6)","v":""},{"$f":"IF(Partners!C104=\"\",\"\",$C$6)","v":""},{"$f":"IF(Partners!C104=\"\",\"\",Partners!C104)","v":""},{"$f":"IF(Partners!C104=\"\",\"\",CONCATENATE(A108,\"000\",Partners!B104))","v":""},null,null,"",{"$f":"IFERROR(VLOOKUP(D108,Vragenlijst!$AY$236:$BA$245,3,FALSE),\"\")","v":""},{"$f":"IF(AND(D108<>\"\",D108<>0),IFERROR(VLOOKUP(D108,Vragenlijst!$C$451:$R$460,16,FALSE),\"nee\"),\"\")","v":""},"",{"$f":"IFERROR(VLOOKUP(K108,Vragenlijst!$AY$465:$BA$477,3,FALSE),\"\")","v":""},{"$f":"IFERROR(VLOOKUP(K108,Vragenlijst!$AY$482:$BB$494,4,FALSE),\"\")","v":""},{"$f":"IF(OR(D108=0,D108=\"\"),\"\",IFERROR(VLOOKUP(D108,Vragenlijst!$C$566:$K$570,9,FALSE),\"\"))","v":""},{"$f":"IF(OR(D108=0,D108=\"\"),\"\",IFERROR(VLOOKUP(D108,Vragenlijst!$C$566:$N$570,12,FALSE),\"\"))","v":""}]
[{"$f":"IF(Partners!C105=\"\",\"\",$A$2)","v":""},{"$f":"IF(Partners!C105=\"\",\"\",$B$6)","v":""},{"$f":"IF(Partners!C105=\"\",\"\",$C$6)","v":""},{"$f":"IF(Partners!C105=\"\",\"\",Partners!C105)","v":""},{"$f":"IF(Partners!C105=\"\",\"\",CONCATENATE(A109,\"000\",Partners!B105))","v":""},null,null,"",{"$f":"IFERROR(VLOOKUP(D109,Vragenlijst!$AY$236:$BA$245,3,FALSE),\"\")","v":""},{"$f":"IF(AND(D109<>\"\",D109<>0),IFERROR(VLOOKUP(D109,Vragenlijst!$C$451:$R$460,16,FALSE),\"nee\"),\"\")","v":""},"",{"$f":"IFERROR(VLOOKUP(K109,Vragenlijst!$AY$465:$BA$477,3,FALSE),\"\")","v":""},{"$f":"IFERROR(VLOOKUP(K109,Vragenlijst!$AY$482:$BB$494,4,FALSE),\"\")","v":""},{"$f":"IF(OR(D109=0,D109=\"\"),\"\",IFERROR(VLOOKUP(D109,Vragenlijst!$C$566:$K$570,9,FALSE),\"\"))","v":""},{"$f":"IF(OR(D109=0,D109=\"\"),\"\",IFERROR(VLOOKUP(D109,Vragenlijst!$C$566:$N$570,12,FALSE),\"\"))","v":""}]
[{"$f":"IF(Partners!C106=\"\",\"\",$A$2)","v":""},{"$f":"IF(Partners!C106=\"\",\"\",$B$6)","v":""},{"$f":"IF(Partners!C106=\"\",\"\",$C$6)","v":""},{"$f":"IF(Partners!C106=\"\",\"\",Partners!C106)","v":""},{"$f":"IF(Partners!C106=\"\",\"\",CONCATENATE(A110,\"000\",Partners!B106))","v":""},null,null,"",{"$f":"IFERROR(VLOOKUP(D110,Vragenlijst!$AY$236:$BA$245,3,FALSE),\"\")","v":""},{"$f":"IF(AND(D110<>\"\",D110<>0),IFERROR(VLOOKUP(D110,Vragenlijst!$C$451:$R$460,16,FALSE),\"nee\"),\"\")","v":""},"",{"$f":"IFERROR(VLOOKUP(K110,Vragenlijst!$AY$465:$BA$477,3,FALSE),\"\")","v":""},{"$f":"IFERROR(VLOOKUP(K110,Vragenlijst!$AY$482:$BB$494,4,FALSE),\"\")","v":""},{"$f":"IF(OR(D110=0,D110=\"\"),\"\",IFERROR(VLOOKUP(D110,Vragenlijst!$C$566:$K$570,9,FALSE),\"\"))","v":""},{"$f":"IF(OR(D110=0,D110=\"\"),\"\",IFERROR(VLOOKUP(D110,Vragenlijst!$C$566:$N$570,12,FALSE),\"\"))","v":""}]
[{"$f":"IF(Partners!C107=\"\",\"\",$A$2)","v":""},{"$f":"IF(Partners!C107=\"\",\"\",$B$6)","v":""},{"$f":"IF(Partners!C107=\"\",\"\",$C$6)","v":""},{"$f":"IF(Partners!C107=\"\",\"\",Partners!C107)","v":""},{"$f":"IF(Partners!C107=\"\",\"\",CONCATENATE(A111,\"000\",Partners!B107))","v":""},null,null,"",{"$f":"IFERROR(VLOOKUP(D111,Vragenlijst!$AY$236:$BA$245,3,FALSE),\"\")","v":""},{"$f":"IF(AND(D111<>\"\",D111<>0),IFERROR(VLOOKUP(D111,Vragenlijst!$C$451:$R$460,16,FALSE),\"nee\"),\"\")","v":""},"",{"$f":"IFERROR(VLOOKUP(K111,Vragenlijst!$AY$465:$BA$477,3,FALSE),\"\")","v":""},{"$f":"IFERROR(VLOOKUP(K111,Vragenlijst!$AY$482:$BB$494,4,FALSE),\"\")","v":""},{"$f":"IF(OR(D111=0,D111=\"\"),\"\",IFERROR(VLOOKUP(D111,Vragenlijst!$C$566:$K$570,9,FALSE),\"\"))","v":""},{"$f":"IF(OR(D111=0,D111=\"\"),\"\",IFERROR(VLOOKUP(D111,Vragenlijst!$C$566:$N$570,12,FALSE),\"\"))","v":""}]
[{"$f":"IF(Partners!C108=\"\",\"\",$A$2)","v":""},{"$f":"IF(Partners!C108=\"\",\"\",$B$6)","v":""},{"$f":"IF(Partners!C108=\"\",\"\",$C$6)","v":""},{"$f":"IF(Partners!C108=\"\",\"\",Partners!C108)","v":""},{"$f":"IF(Partners!C108=\"\",\"\",CONCATENATE(A112,\"000\",Partners!B108))","v":""},null,null,"",{"$f":"IFERROR(VLOOKUP(D112,Vragenlijst!$AY$236:$BA$245,3,FALSE),\"\")","v":""},{"$f":"IF(AND(D112<>\"\",D112<>0),IFERROR(VLOOKUP(D112,Vragenlijst!$C$451:$R$460,16,FALSE),\"nee\"),\"\")","v":""},"",{"$f":"IFERROR(VLOOKUP(K112,Vragenlijst!$AY$465:$BA$477,3,FALSE),\"\")","v":""},{"$f":"IFERROR(VLOOKUP(K112,Vragenlijst!$AY$482:$BB$494,4,FALSE),\"\")","v":""},{"$f":"IF(OR(D112=0,D112=\"\"),\"\",IFERROR(VLOOKUP(D112,Vragenlijst!$C$566:$K$570,9,FALSE),\"\"))","v":""},{"$f":"IF(OR(D112=0,D112=\"\"),\"\",IFERROR(VLOOKUP(D112,Vragenlijst!$C$566:$N$570,12,FALSE),\"\"))","v":""}]
[{"$f":"IF(Partners!C109=\"\",\"\",$A$2)","v":""},{"$f":"IF(Partners!C109=\"\",\"\",$B$6)","v":""},{"$f":"IF(Partners!C109=\"\",\"\",$C$6)","v":""},{"$f":"IF(Partners!C109=\"\",\"\",Partners!C109)","v":""},{"$f":"IF(Partners!C109=\"\",\"\",CONCATENATE(A113,\"000\",Partners!B109))","v":""},null,null,"",{"$f":"IFERROR(VLOOKUP(D113,Vragenlijst!$AY$236:$BA$245,3,FALSE),\"\")","v":""},{"$f":"IF(AND(D113<>\"\",D113<>0),IFERROR(VLOOKUP(D113,Vragenlijst!$C$451:$R$460,16,FALSE),\"nee\"),\"\")","v":""},"",{"$f":"IFERROR(VLOOKUP(K113,Vragenlijst!$AY$465:$BA$477,3,FALSE),\"\")","v":""},{"$f":"IFERROR(VLOOKUP(K113,Vragenlijst!$AY$482:$BB$494,4,FALSE),\"\")","v":""},{"$f":"IF(OR(D113=0,D113=\"\"),\"\",IFERROR(VLOOKUP(D113,Vragenlijst!$C$566:$K$570,9,FALSE),\"\"))","v":""},{"$f":"IF(OR(D113=0,D113=\"\"),\"\",IFERROR(VLOOKUP(D113,Vragenlijst!$C$566:$N$570,12,FALSE),\"\"))","v":""}]
[{"$f":"IF(Partners!C110=\"\",\"\",$A$2)","v":""},{"$f":"IF(Partners!C110=\"\",\"\",$B$6)","v":""},{"$f":"IF(Partners!C110=\"\",\"\",$C$6)","v":""},{"$f":"IF(Partners!C110=\"\",\"\",Partners!C110)","v":""},{"$f":"IF(Partners!C110=\"\",\"\",CONCATENATE(A114,\"000\",Partners!B110))","v":""},null,null,"",{"$f":"IFERROR(VLOOKUP(D114,Vragenlijst!$AY$236:$BA$245,3,FALSE),\"\")","v":""},{"$f":"IF(AND(D114<>\"\",D114<>0),IFERROR(VLOOKUP(D114,Vragenlijst!$C$451:$R$460,16,FALSE),\"nee\"),\"\")","v":""},"",{"$f":"IFERROR(VLOOKUP(K114,Vragenlijst!$AY$465:$BA$477,3,FALSE),\"\")","v":""},{"$f":"IFERROR(VLOOKUP(K114,Vragenlijst!$AY$482:$BB$494,4,FALSE),\"\")","v":""},{"$f":"IF(OR(D114=0,D114=\"\"),\"\",IFERROR(VLOOKUP(D114,Vragenlijst!$C$566:$K$570,9,FALSE),\"\"))","v":""},{"$f":"IF(OR(D114=0,D114=\"\"),\"\",IFERROR(VLOOKUP(D114,Vragenlijst!$C$566:$N$570,12,FALSE),\"\"))","v":""}]
[{"$f":"IF(Partners!C111=\"\",\"\",$A$2)","v":""},{"$f":"IF(Partners!C111=\"\",\"\",$B$6)","v":""},{"$f":"IF(Partners!C111=\"\",\"\",$C$6)","v":""},{"$f":"IF(Partners!C111=\"\",\"\",Partners!C111)","v":""},{"$f":"IF(Partners!C111=\"\",\"\",CONCATENATE(A115,\"000\",Partners!B111))","v":""},null,null,"",{"$f":"IFERROR(VLOOKUP(D115,Vragenlijst!$AY$236:$BA$245,3,FALSE),\"\")","v":""},{"$f":"IF(AND(D115<>\"\",D115<>0),IFERROR(VLOOKUP(D115,Vragenlijst!$C$451:$R$460,16,FALSE),\"nee\"),\"\")","v":""},"",{"$f":"IFERROR(VLOOKUP(K115,Vragenlijst!$AY$465:$BA$477,3,FALSE),\"\")","v":""},{"$f":"IFERROR(VLOOKUP(K115,Vragenlijst!$AY$482:$BB$494,4,FALSE),\"\")","v":""},{"$f":"IF(OR(D115=0,D115=\"\"),\"\",IFERROR(VLOOKUP(D115,Vragenlijst!$C$566:$K$570,9,FALSE),\"\"))","v":""},{"$f":"IF(OR(D115=0,D115=\"\"),\"\",IFERROR(VLOOKUP(D115,Vragenlijst!$C$566:$N$570,12,FALSE),\"\"))","v":""}]
[{"$f":"IF(Partners!C112=\"\",\"\",$A$2)","v":""},{"$f":"IF(Partners!C112=\"\",\"\",$B$6)","v":""},{"$f":"IF(Partners!C112=\"\",\"\",$C$6)","v":""},{"$f":"IF(Partners!C112=\"\",\"\",Partners!C112)","v":""},{"$f":"IF(Partners!C112=\"\",\"\",CONCATENATE(A116,\"00\",Partners!B112))","v":""},null,null,"",{"$f":"IFERROR(VLOOKUP(D116,Vragenlijst!$AY$236:$BA$245,3,FALSE),\"\")","v":""},{"$f":"IF(AND(D116<>\"\",D116<>0),IFERROR(VLOOKUP(D116,Vragenlijst!$C$451:$R$460,16,FALSE),\"nee\"),\"\")","v":""},"",{"$f":"IFERROR(VLOOKUP(K116,Vragenlijst!$AY$465:$BA$477,3,FALSE),\"\")","v":""},{"$f":"IFERROR(VLOOKUP(K116,Vragenlijst!$AY$482:$BB$494,4,FALSE),\"\")","v":""},{"$f":"IF(OR(D116=0,D116=\"\"),\"\",IFERROR(VLOOKUP(D116,Vragenlijst!$C$566:$K$570,9,FALSE),\"\"))","v":""},{"$f":"IF(OR(D116=0,D116=\"\"),\"\",IFERROR(VLOOKUP(D116,Vragenlijst!$C$566:$N$570,12,FALSE),\"\"))","v":""}]
[]
[]
[]
[]
[]
[]
[]
["Materiaalstromen"]
["id_CA","RapportJaar","invuldatum","Q11_Materiaal","Q11_MilieustraatBS","Q11_KringloopwinkelBS","Q11_RepairCafeBS","Q11_SociaalmaatschappelijkBS","Q11_OnderwijsBS","Q11_WerkplaatsBS","Q11_DeeleconomieBS","Q11_OndernemersBS","Q11_DemontageBS","Q11_AlternatiefElementBS","Q12_DirectHergebruikH","Q12_HergebruikNaReparerenH","Q12_RepurposeH","Q12_LesmateriaalH","Q12_DemontageVoorHergebruikH","Q12_DemontageVoorRecyclingH","Q12_AndersH"]
[{"$f":"$A$2","v":1001},{"$f":"$B$6","v":"2025"},{"$f":"$C$6","v":"00:00:00"},"Elektrische apparaten",{"$f":"Vragenlijst!BD174","v":0},{"$f":"Vragenlijst!BE174","v":0},{"$f":"Vragenlijst!BF174","v":0},{"$f":"Vragenlijst!BG174","v":0},{"$f":"Vragenlijst!BH174","v":0},{"$f":"Vragenlijst!BI174","v":0},{"$f":"Vragenlijst!BJ174","v":0},{"$f":"Vragenlijst!BK174","v":0},{"$f":"Vragenlijst!BL174","v":0},{"$f":"Vragenlijst!BM174","v":0},{"$f":"Vragenlijst!AU189","v":0},{"$f":"Vragenlijst!AV189","v":0},{"$f":"Vragenlijst!AW189","v":0},{"$f":"Vragenlijst!AX189","v":0},{"$f":"Vragenlijst!AY189","v":0},{"$f":"Vragenlijst!AZ189","v":0},{"$f":"Vragenlijst!BA189","v":0}]
[{"$f":"$A$2","v":1001},"2025","00:00:00","Fietsen",{"$f":"Vragenlijst!BD175","v":0},{"$f":"Vragenlijst!BE175","v":0},{"$f":"Vragenlijst!BF175","v":0},{"$f":"Vragenlijst!BG175","v":0},{"$f":"Vragenlijst!BH175","v":0},{"$f":"Vragenlijst!BI175","v":0},{"$f":"Vragenlijst!BJ175","v":0},{"$f":"Vragenlijst!BK175","v":0},{"$f":"Vragenlijst!BL175","v":0},{"$f":"Vragenlijst!BM175","v":0},{"$f":"Vragenlijst!AU190","v":0},{"$f":"Vragenlijst!AV190","v":0},{"$f":"Vragenlijst!AW190","v":0},{"$f":"Vragenlijst!AX190","v":0},{"$f":"Vragenlijst!AY190","v":0},{"$f":"Vragenlijst!AZ190","v":0},{"$f":"Vragenlijst!BA190","v":0}]
[1001,"2025","00:00:00","Meubilair en onderdelen",{"$f":"Vragenlijst!BD176","v":0},{"$f":"Vragenlijst!BE176","v":0},{"$f":"Vragenlijst!BF176","v":0},{"$f":"Vragenlijst!BG176","v":0},{"$f":"Vragenlijst!BH176","v":0},{"$f":"Vragenlijst!BI176","v":0},{"$f":"Vragenlijst!BJ176","v":0},{"$f":"Vragenlijst!BK176","v":0},{"$f":"Vragenlijst!BL176","v":0},{"$f":"Vragenlijst!BM176","v":0},{"$f":"Vragenlijst!AU191","v":0},{"$f":"Vragenlijst!AV191","v":0},{"$f":"Vragenlijst!AW191","v":0},{"$f":"Vragenlijst!AX191","v":0},{"$f":"Vragenlijst!AY191","v":0},{"$f":"Vragenlijst!AZ191","v":0},{"$f":"Vragenlijst!BA191","v":0}]
[1001,"2025","00:00:00","Textiel",{"$f":"Vragenlijst!BD177","v":0},{"$f":"Vragenlijst!BE177","v":0},{"$f":"Vragenlijst!BF177","v":0},{"$f":"Vragenlijst!BG177","v":0},{"$f":"Vragenlijst!BH177","v":0},{"$f":"Vragenlijst!BI177","v":0},{"$f":"Vragenlijst!BJ177","v":0},{"$f":"Vragenlijst!BK177","v":0},{"$f":"Vragenlijst!BL177","v":0},{"$f":"Vragenlijst!BM177","v":0},{"$f":"Vragenlijst!AU192","v":0},{"$f":"Vragenlijst!AV192","v":0},{"$f":"Vragenlijst!AW192","v":0},{"$f":"Vragenlijst!AX192","v":0},{"$f":"Vragenlijst!AY192","v":0},{"$f":"Vragenlijst!AZ192","v":0},{"$f":"Vragenlijst!BA192","v":0}]
[1001,"2025","00:00:00","Metaal / staal",{"$f":"Vragenlijst!BD178","v":0},{"$f":"Vragenlijst!BE178","v":0},{"$f":"Vragenlijst!BF178","v":0},{"$f":"Vragenlijst!BG178","v":0},{"$f":"Vragenlijst!BH178","v":0},{"$f":"Vragenlijst!BI178","v":0},{"$f":"Vragenlijst!BJ178","v":0},{"$f":"Vragenlijst!BK178","v":0},{"$f":"Vragenlijst!BL178","v":0},{"$f":"Vragenlijst!BM178","v":0},{"$f":"Vragenlijst!AU193","v":0},{"$f":"Vragenlijst!AV193","v":0},{"$f":"Vragenlijst!AW193","v":0},{"$f":"Vragenlijst!AX193","v":0},{"$f":"Vragenlijst!AY193","v":0},{"$f":"Vragenlijst!AZ193","v":0},{"$f":"Vragenlijst!BA193","v":0}]
[1001,"2025","00:00:00","Hout (balken, plaatmateriaal)",{"$f":"Vragenlijst!BD179","v":0},{"$f":"Vragenlijst!BE179","v":0},{"$f":"Vragenlijst!BF179","v":0},{"$f":"Vragenlijst!BG179","v":0},{"$f":"Vragenlijst!BH179","v":0},{"$f":"Vragenlijst!BI179","v":0},{"$f":"Vragenlijst!BJ179","v":0},{"$f":"Vragenlijst!BK179","v":0},{"$f":"Vragenlijst!BL179","v":0},{"$f":"Vragenlijst!BM179","v":0},{"$f":"Vragenlijst!AU194","v":0},{"$f":"Vragenlijst!AV194","v":0},{"$f":"Vragenlijst!AW194","v":0},{"$f":"Vragenlijst!AX194","v":0},{"$f":"Vragenlijst!AY194","v":0},{"$f":"Vragenlijst!AZ194","v":0},{"$f":"Vragenlijst!BA194","v":0}]
[1001,"2025","00:00:00","Overige bouwmaterialen (anders dan hout en metaal)",{"$f":"Vragenlijst!BD180","v":0},{"$f":"Vragenlijst!BE180","v":0},{"$f":"Vragenlijst!BF180","v":0},{"$f":"Vragenlijst!BG180","v":0},{"$f":"Vragenlijst!BH180","v":0},{"$f":"Vragenlijst!BI180","v":0},{"$f":"Vragenlijst!BJ180","v":0},{"$f":"Vragenlijst!BK180","v":0},{"$f":"Vragenlijst!BL180","v":0},{"$f":"Vragenlijst!BM180","v":0},{"$f":"Vragenlijst!AU195","v":0},{"$f":"Vragenlijst!AV195","v":0},{"$f":"Vragenlijst!AW195","v":0},{"$f":"Vragenlijst!AX195","v":0},{"$f":"Vragenlijst!AY195","v":0},{"$f":"Vragenlijst!AZ195","v":0},{"$f":"Vragenlijst!BA195","v":0}]
[1001,"2025","00:00:00",{"$f":"Vragenlijst!C196","v":0},{"$f":"Vragenlijst!BD181","v":0},{"$f":"Vragenlijst!BE181","v":0},{"$f":"Vragenlijst!BF181","v":0},{"$f":"Vragenlijst!BG181","v":0},{"$f":"Vragenlijst!BH181","v":0},{"$f":"Vragenlijst!BI181","v":0},{"$f":"Vragenlijst!BJ181","v":0},{"$f":"Vragenlijst!BK181","v":0},{"$f":"Vragenlijst!BL181","v":0},{"$f":"Vragenlijst!BM181","v":0},{"$f":"Vragenlijst!AU196","v":0},{"$f":"Vragenlijst!AV196","v":0},{"$f":"Vragenlijst!AW196","v":0},{"$f":"Vragenlijst!AX196","v":0},{"$f":"Vragenlijst!AY196","v":0},{"$f":"Vragenlijst!AZ196","v":0},{"$f":"Vragenlijst!BA196","v":0}]
[1001,"2025","00:00:00",{"$f":"Vragenlijst!C197","v":0},{"$f":"Vragenlijst!BD182","v":0},{"$f":"Vragenlijst!BE182","v":0},{"$f":"Vragenlijst!BF182","v":0},{"$f":"Vragenlijst!BG182","v":0},{"$f":"Vragenlijst!BH182","v":0},{"$f":"Vragenlijst!BI182","v":0},{"$f":"Vragenlijst!BJ182","v":0},{"$f":"Vragenlijst!BK182","v":0},{"$f":"Vragenlijst!BL182","v":0},{"$f":"Vragenlijst!BM182","v":0},{"$f":"Vragenlijst!AU197","v":0},{"$f":"Vragenlijst!AV197","v":0},{"$f":"Vragenlijst!AW197","v":0},{"$f":"Vragenlijst!AX197","v":0},{"$f":"Vragenlijst!AY197","v":0},{"$f":"Vragenlijst!AZ197","v":0},{"$f":"Vragenlijst!BA197","v":0}]
[1001,"2025","00:00:00",{"$f":"Vragenlijst!C198","v":0},{"$f":"Vragenlijst!BD183","v":0},{"$f":"Vragenlijst!BE183","v":0},{"$f":"Vragenlijst!BF183","v":0},{"$f":"Vragenlijst!BG183","v":0},{"$f":"Vragenlijst!BH183","v":0},{"$f":"Vragenlijst!BI183","v":0},{"$f":"Vragenlijst!BJ183","v":0},{"$f":"Vragenlijst!BK183","v":0},{"$f":"Vragenlijst!BL183","v":0},{"$f":"Vragenlijst!BM183","v":0},{"$f":"Vragenlijst!AU198","v":0},{"$f":"Vragenlijst!AV198","v":0},{"$f":"Vragenlijst!AW198","v":0},{"$f":"Vragenlijst!AX198","v":0},{"$f":"Vragenlijst!AY198","v":0},{"$f":"Vragenlijst!AZ198","v":0},{"$f":"Vragenlijst!BA198","v":0}]
[1001,"2025","00:00:00",{"$f":"Vragenlijst!C199","v":0},{"$f":"Vragenlijst!BD184","v":0},{"$f":"Vragenlijst!BE184","v":0},{"$f":"Vragenlijst!BF184","v":0},{"$f":"Vragenlijst!BG184","v":0},{"$f":"Vragenlijst!BH184","v":0},{"$f":"Vragenlijst!BI184","v":0},{"$f":"Vragenlijst!BJ184","v":0},{"$f":"Vragenlijst!BK184","v":0},{"$f":"Vragenlijst!BL184","v":0},{"$f":"Vragenlijst!BM184","v":0},{"$f":"Vragenlijst!AU199","v":0},{"$f":"Vragenlijst!AV199","v":0},{"$f":"Vragenlijst!AW199","v":0},{"$f":"Vragenlijst!AX199","v":0},{"$f":"Vragenlijst!AY199","v":0},{"$f":"Vragenlijst!AZ199","v":0},{"$f":"Vragenlijst!BA199","v":0}]
[]
[]
["Milieustraat"]
["id_CA","RapportJaar","invuldatum","Q13_AantalMilieustraten","Q14_AantalMilieustratenCA","Q14_OpmMilieust","Q15_KringloopwinkelEerst","Q15_PersoneelBeoordeelt","Q15_ContainerHergebruikKringloop","Q15_ContainerCirculaireOndernemers","Q15_ContainerReparatie","Q15_PersoneelSorteertHergebruik","Q15_AndersMilieustraat","Q15_Geen","Q15_AndersNamelijk"]
[{"$f":"$A$2","v":1001},{"$f":"$B$6","v":"2025"},{"$f":"$C$6","v":"00:00:00"},{"$f":"Vragenlijst!AI204","v":0},{"$f":"Vragenlijst!AI206","v":0},{"$f":"IF(Vragenlijst!C211=\"\",0,1)","v":0},{"$f":"Vragenlijst!AV217","v":0},{"$f":"Vragenlijst!AV218","v":0},{"$f":"Vragenlijst!AV219","v":0},{"$f":"Vragenlijst!AV220","v":0},{"$f":"Vragenlijst!AV221","v":0},{"$f":"Vragenlijst!AV222","v":0},{"$f":"Vragenlijst!AV223","v":0},{"$f":"Vragenlijst!AV224","v":0},{"$f":"Vragenlijst!I223","v":0}]
[]
[]
["Kringloop zie partners"]
[]
[]
["Reparatie"]
["id_CA","RapportJaar","invuldatum","Q17_ReparatieWelOFNIET","Q18_ReparatieGratisOfDonatie","Q18_ReparatieBetaald","Q18_Opmerking","Q19_Afgeven","Q19_SamenRepareren","Q19_Keuze","Q19_Opmerking","Q20_AantalLocatiesRepairCafe","Q21_Openingstijden","Q21_UrenPerWeek/Maand","Q21_AantalUren","Q21_OpmerkingReparatieOpeningstijden","Q22_DigitaalEigenAdmin","Q22_DigitaalRepairmonitor","Q22_FysiekBoek","Q22_GeenAdmin","Q22_OpmAdmin","Q23_InitiatiefReparatie","Q24_RepInitiatievenStopReden1","Q24_RepInitiatievenStopReden2","Q24_RepInitiatievenStopReden3","Q24_RepInitiatievenStopReden4","Q243_RepInitiatievenStopReden5","Q24_RepInitiatievenStopReden6"]
[{"$f":"$A$2","v":1001},{"$f":"$B$6","v":"2025"},{"$f":"$C$6","v":"00:00:00"},{"$f":"Vragenlijst!M264","v":"00:00:00"},{"$f":"Vragenlijst!AU270","v":0},{"$f":"Vragenlijst!AU271","v":0},{"$f":"Vragenlijst!C274","v":0},{"$f":"Vragenlijst!AU279","v":0},{"$f":"Vragenlijst!AU280","v":0},{"$f":"Vragenlijst!AU281","v":0},{"$f":"Vragenlijst!C284","v":0},{"$f":"Vragenlijst!AC287","v":0},0,{"$f":"IF(M149=sleutels!A38,\"uren per week\",IF(M149=sleutels!A39,\"uren per maand\",IF(M149=1,\"uren per week\",\"\")))","v":""},{"$f":"IF(M149=1,40,IF(M149=2,Vragenlijst!X293,IF(data!M149=3,Vragenlijst!X294,0)))","v":0},{"$f":"Vragenlijst!C297","v":0},{"$f":"Vragenlijst!AU304","v":0},{"$f":"Vragenlijst!AU305","v":0},{"$f":"Vragenlijst!AU306","v":0},{"$f":"Vragenlijst!AU307","v":0},{"$f":"Vragenlijst!C310","v":0},{"$f":"IF(Vragenlijst!AU327=TRUE,\"nee\",\"ja\")","v":"ja"},{"$f":"IF(V149=\"nee\",\"nvt\",Vragenlijst!C333)","v":0},{"$f":"Vragenlijst!C334","v":0},{"$f":"Vragenlijst!C335","v":0},{"$f":"Vragenlijst!C336","v":0},{"$f":"Vragenlijst!C337","v":0},{"$f":"Vragenlijst!C338","v":0}]
[]
[]
["id_CA","RapportJaar","invuldatum","Q17_Reparatieorganiatie","Q17_Aanwezig","Q17_Particulieren","Q17_Zakelijk","Q17_AndersNamelijk"]
[{"$f":"$A$2","v":1001},{"$f":"$B$6","v":"2025"},{"$f":"$C$6","v":"00:00:00"},"RepairCafé",{"$f":"IF(OR(Vragenlijst!AU257,Vragenlijst!AV257),TRUE,FALSE)","v":{"$error":"#VALUE!"}},{"$f":"Vragenlijst!AU257","v":0},{"$f":"Vragenlijst!AV257","v":0}]
[{"$f":"$A$2","v":1001},"2025","00:00:00","SociaalDomein",{"$f":"IF(OR(Vragenlijst!AU258,Vragenlijst!AV258),TRUE,FALSE)","v":{"$error":"#VALUE!"}},{"$f":"Vragenlijst!AU258","v":0},{"$f":"Vragenlijst!AV258","v":0}]
[1001,"2025","00:00:00","Kringloop",{"$f":"IF(OR(Vragenlijst!AU259,Vragenlijst!AV259),TRUE,FALSE)","v":{"$error":"#VALUE!"}},{"$f":"Vragenlijst!AU259","v":0},{"$f":"Vragenlijst!AV259","v":0}]
[1001,"2025","00:00:00","CommercieelReparatiebedrijf",{"$f":"IF(OR(Vragenlijst!AU260,Vragenlijst!AV260),TRUE,FALSE)","v":{"$error":"#VALUE!"}},{"$f":"Vragenlijst!AU260","v":0},{"$f":"Vragenlijst!AV260","v":0}]
[1001,"2025","00:00:00","DIY",{"$f":"IF(OR(Vragenlijst!AU261,Vragenlijst!AV261),TRUE,FALSE)","v":{"$error":"#VALUE!"}},{"$f":"Vragenlijst!AU261","v":0},{"$f":"Vragenlijst!AV261","v":0}]
[1001,"2025","00:00:00","Anders",{"$f":"IF(OR(Vragenlijst!AU262,Vragenlijst!AV262),TRUE,FALSE)","v":{"$error":"#VALUE!"}},{"$f":"Vragenlijst!AU262","v":0},{"$f":"Vragenlijst!AV262","v":0},{"$f":"Vragenlijst!H262","v":0}]
[]
[]
["id_CA","RapportJaar","invuldatum","Q23_InitiatiefReparatie","Q23_Start","Q23_Status"]
[{"$f":"$A$2","v":1001},{"$f":"$B$6","v":"2025"},{"$f":"$C$6","v":"00:00:00"},{"$f":"Vragenlijst!C315","v":0},{"$f":"Vragenlijst!AE315","v":0},{"$f":"IF(Vragenlijst!AU315=TRUE,\"loopt door\",IF(Vragenlijst!AK315=\"\",0,CONCATENATE(\"gestopt in \",Vragenlijst!AK315)))","v":0}]
[{"$f":"$A$2","v":1001},"2025","00:00:00",{"$f":"Vragenlijst!C316","v":0},{"$f":"Vragenlijst!AE316","v":0},{"$f":"IF(Vragenlijst!AU316=TRUE,\"loopt door\",IF(Vragenlijst!AK316=\"\",0,CONCATENATE(\"gestopt in \",Vragenlijst!AK316)))","v":0}]
[1001,"2025","00:00:00",{"$f":"Vragenlijst!C317","v":0},{"$f":"Vragenlijst!AE317","v":0},{"$f":"IF(Vragenlijst!AU317=TRUE,\"loopt door\",IF(Vragenlijst!AK317=\"\",0,CONCATENATE(\"gestopt in \",Vragenlijst!AK317)))","v":0}]
[1001,"2025","00:00:00",{"$f":"Vragenlijst!C318","v":0},{"$f":"Vragenlijst!AE318","v":0},{"$f":"IF(Vragenlijst!AU318=TRUE,\"loopt door\",IF(Vragenlijst!AK318=\"\",0,CONCATENATE(\"gestopt in \",Vragenlijst!AK318)))","v":0}]
[1001,"2025","00:00:00",{"$f":"Vragenlijst!C319","v":0},{"$f":"Vragenlijst!AE319","v":0},{"$f":"IF(Vragenlijst!AU319=TRUE,\"loopt door\",IF(Vragenlijst!AK319=\"\",0,CONCATENATE(\"gestopt in \",Vragenlijst!AK319)))","v":0}]
[{"$f":"$A$2","v":1001},"2025","00:00:00",{"$f":"Vragenlijst!C320","v":0},{"$f":"Vragenlijst!AE320","v":0},{"$f":"IF(Vragenlijst!AU320=TRUE,\"loopt door\",IF(Vragenlijst!AK320=\"\",0,CONCATENATE(\"gestopt in \",Vragenlijst!AK320)))","v":0}]
[1001,"2025","00:00:00",{"$f":"Vragenlijst!C321","v":0},{"$f":"Vragenlijst!AE321","v":0},{"$f":"IF(Vragenlijst!AU321=TRUE,\"loopt door\",IF(Vragenlijst!AK321=\"\",0,CONCATENATE(\"gestopt in \",Vragenlijst!AK321)))","v":0}]
[1001,"2025","00:00:00",{"$f":"Vragenlijst!C322","v":0},{"$f":"Vragenlijst!AE322","v":0},{"$f":"IF(Vragenlijst!AU322=TRUE,\"loopt door\",IF(Vragenlijst!AK322=\"\",0,CONCATENATE(\"gestopt in \",Vragenlijst!AK322)))","v":0}]
[1001,"2025","00:00:00",{"$f":"Vragenlijst!C323","v":0},{"$f":"Vragenlijst!AE323","v":0},{"$f":"IF(Vragenlijst!AU323=TRUE,\"loopt door\",IF(Vragenlijst!AK323=\"\",0,CONCATENATE(\"gestopt in \",Vragenlijst!AK323)))","v":0}]
[1001,"2025","00:00:00",{"$f":"Vragenlijst!C324","v":0},{"$f":"Vragenlijst!AE324","v":0},{"$f":"IF(Vragenlijst!AU324=TRUE,\"loopt door\",IF(Vragenlijst!AK324=\"\",0,CONCATENATE(\"gestopt in \",Vragenlijst!AK324)))","v":0}]
[1001,"2025","00:00:00",{"$f":"Vragenlijst!C325","v":0},{"$f":"Vragenlijst!AE325","v":0},{"$f":"IF(Vragenlijst!AU325=TRUE,\"loopt door\",IF(Vragenlijst!AK325=\"\",0,CONCATENATE(\"gestopt in \",Vragenlijst!AK325)))","v":0}]
[]
[]
[]
["Onderwijs"]
["id_CA","RapportJaar","invuldatum","Q25_Basisonderwijs","Q25_SpeciaalOnderwijs","Q25_Praktijkonderwijs","Q25_VMBO","Q25_HAVO","Q25_VWO","Q25_Volwasseneneducatie","Q25_MBO","Q25_HBO","Q25_Universiteit","Q25WOB","Q25_Anders","Q25_Anders_namelijk","Q25_Geen","Q25_Opmerking","Q26_HergebruikProducten","Q26_Reparatie","Q26_DemontageOnderdelen","Q26_UpcyclingHergebruikMaterialen","Q26_RefurbishProducten","Q26_DemontageVoorRecycling","Q26_NogNiet","Q26_Opmerking","Q27_Textiel","Q27_Elektrische apparaten","Q27_Meubels","Q27_Anders","Q27_AndersNamelijk","Q28_ScholierenStudenten","Q28_VervolgopleidingVolwassenen","Q28_MedewerkendeRepaircafe","Q28_MedewerkendeRepairwerkplaats","Q28_SWpersoneel","Q28_ParticulierenInwoners","Q28_Anders","Q28_AndersNamelijk"]
[{"$f":"$A$2","v":1001},{"$f":"$B$6","v":"2025"},{"$f":"$C$6","v":"00:00:00"},{"$f":"Vragenlijst!AT347","v":0},{"$f":"Vragenlijst!AU347","v":0},{"$f":"Vragenlijst!AV347","v":0},{"$f":"Vragenlijst!AW347","v":0},{"$f":"Vragenlijst!AX347","v":0},{"$f":"Vragenlijst!AY347","v":0},{"$f":"Vragenlijst!AZ347","v":0},{"$f":"Vragenlijst!BA347","v":0},{"$f":"Vragenlijst!BB347","v":0},{"$f":"Vragenlijst!BC347","v":0},{"$f":"Vragenlijst!BD347","v":0},{"$f":"Vragenlijst!BE347","v":0},{"$f":"Vragenlijst!AK346","v":0},{"$f":"Vragenlijst!BF347","v":0},{"$f":"Vragenlijst!C354","v":0},{"$f":"Vragenlijst!AU359","v":0},{"$f":"Vragenlijst!AU360","v":0},{"$f":"Vragenlijst!AU361","v":0},{"$f":"Vragenlijst!AU362","v":0},{"$f":"Vragenlijst!AU363","v":0},{"$f":"Vragenlijst!AU364","v":0},{"$f":"Vragenlijst!AU365","v":0},{"$f":"Vragenlijst!C368","v":0},{"$f":"Vragenlijst!AT375","v":0},{"$f":"Vragenlijst!AT376","v":0},{"$f":"Vragenlijst!AT377","v":0},{"$f":"Vragenlijst!AT378","v":0},{"$f":"Vragenlijst!O378","v":0},{"$f":"Vragenlijst!AU382","v":0},{"$f":"Vragenlijst!AU383","v":0},{"$f":"Vragenlijst!AU384","v":0},{"$f":"Vragenlijst!AU385","v":0},{"$f":"Vragenlijst!AU386","v":0},{"$f":"Vragenlijst!AU387","v":0},{"$f":"Vragenlijst!AU388","v":0},{"$f":"Vragenlijst!U388","v":0}]
[]
[]
["Inclusief werkgeverschap"]
["id_CA","RapportJaar","invuldatum","Q29_MensenZonderWerk","Q29_MensenMetArbeidsuitdaging","Q29_MensenInOpleiding","Q29_MensenOpZoekNaarVeiligheid","Q29_VrijwilligersEnOverig","Q29_OverigBetaaldeMedewerkers","Q30_Doorstroom","Q31_InitiatiefSA","Q32_IWInitiatievenStopReden1","Q32_IWInitiatievenStopReden2","Q32_IWInitiatievenStopReden3","Q32_IWInitiatievenStopReden4","Q32_IWInitiatievenStopReden5","Q32_IWInitiatievenStopReden6","Q33_Vrijwilligers",{"$f":"CONCATENATE(\"Q36_FTE-PSO\",B202-1)","v":"Q36_FTE-PSO2024"},{"$f":"CONCATENATE(\"Q36_FTE-PSO\",B202)","v":"Q36_FTE-PSO2025"},"Q36_Opmerking",{"$f":"CONCATENATE(\"Q37_AantalPersonenWOB\",B202-1)","v":"Q37_AantalPersonenWOB2024"},{"$f":"CONCATENATE(\"Q37_AantalPersonenWOB\",B202)","v":"Q37_AantalPersonenWOB2025"},"Q38_AantalLWT","Q38_LOT_WOB_perc","Q38_LOT_LS_perc"]
[{"$f":"$A$2","v":1001},{"$f":"$B$6","v":"2025"},{"$f":"$C$6","v":"00:00:00"},{"$f":"Vragenlijst!AU407","v":"00:00:00"},{"$f":"Vragenlijst!AU408","v":"00:00:00"},{"$f":"Vragenlijst!AU409","v":"00:00:00"},{"$f":"Vragenlijst!AU410","v":"00:00:00"},{"$f":"Vragenlijst!AU411","v":"00:00:00"},{"$f":"Vragenlijst!AU412","v":"00:00:00"},{"$f":"Vragenlijst!C416","v":0},{"$f":"IF(Vragenlijst!AU433=TRUE,\"nee\",\"ja\")","v":"ja"},{"$f":"IF(Vragenlijst!AT439=\"nvt\",\"nvt\",Vragenlijst!C439)","v":"nvt"},{"$f":"Vragenlijst!C440","v":0},{"$f":"Vragenlijst!C441","v":0},{"$f":"Vragenlijst!C442","v":0},{"$f":"Vragenlijst!C443","v":0},{"$f":"Vragenlijst!C444","v":0},{"$f":"IF(Vragenlijst!AU449=FALSE,TRUE,FALSE)","v":true},{"$f":"IF(Vragenlijst!AU501=TRUE,\"niet bekend\",Vragenlijst!H501)","v":0},{"$f":"IF(Vragenlijst!AU502=TRUE,\"niet bekend\",Vragenlijst!H502)","v":0},{"$f":"Vragenlijst!C505","v":0},{"$f":"IF(AND(Vragenlijst!H501<>\"\",Vragenlijst!AU501=FALSE),Vragenlijst!H501,\"onbekend\")","v":"onbekend"},{"$f":"IF(AND(Vragenlijst!H502<>\"\",Vragenlijst!AU502=FALSE),Vragenlijst!H502,\"onbekend\")","v":"onbekend"},{"$f":"IF(AND(Vragenlijst!C517<>\"\",Vragenlijst!AU517=FALSE),Vragenlijst!C517,\"onbekend\")","v":"onbekend"},{"$f":"IF(AND(Vragenlijst!C520=\"\",Vragenlijst!AU520=TRUE),\"onbekend\",IF(Vragenlijst!C520=\"\",Vragenlijst!C528,IF(Vragenlijst!C520<>\"\",Vragenlijst!C520/Vragenlijst!C517)))","v":0},{"$f":"IF(AND(Vragenlijst!C521=\"\",Vragenlijst!AU520=TRUE),\"onbekend\",IF(Vragenlijst!C521=\"\",Vragenlijst!C529,IF(Vragenlijst!C521<>\"\",Vragenlijst!C521/Vragenlijst!C517)))","v":0}]
[]
[]
["id_CA","RapportJaar","invuldatum","Q31_InitiatiefSA","Q31_Start","Q31_Status"]
[{"$f":"$A$2","v":1001},{"$f":"$B$6","v":"2025"},{"$f":"$C$6","v":"00:00:00"},{"$f":"Vragenlijst!C421","v":0},{"$f":"Vragenlijst!AE421","v":0},{"$f":"IF(Vragenlijst!AU421=TRUE,\"loopt door\",IF(Vragenlijst!AK421=\"\",0,CONCATENATE(\"gestopt in \",Vragenlijst!AK421)))","v":0}]
[{"$f":"$A$2","v":1001},"2025","00:00:00",{"$f":"Vragenlijst!C422","v":0},{"$f":"Vragenlijst!AE422","v":0},{"$f":"IF(Vragenlijst!AU422=TRUE,\"loopt door\",IF(Vragenlijst!AK422=\"\",0,CONCATENATE(\"gestopt in \",Vragenlijst!AK422)))","v":0}]
[1001,"2025","00:00:00",{"$f":"Vragenlijst!C423","v":0},{"$f":"Vragenlijst!AE423","v":0},{"$f":"IF(Vragenlijst!AU423=TRUE,\"loopt door\",IF(Vragenlijst!AK423=\"\",0,CONCATENATE(\"gestopt in \",Vragenlijst!AK423)))","v":0}]
[1001,"2025","00:00:00",{"$f":"Vragenlijst!C424","v":0},{"$f":"Vragenlijst!AE424","v":0},{"$f":"IF(Vragenlijst!AU424=TRUE,\"loopt door\",IF(Vragenlijst!AK424=\"\",0,CONCATENATE(\"gestopt in \",Vragenlijst!AK424)))","v":0}]
[1001,"2025","00:00:00",{"$f":"Vragenlijst!C425","v":0},{"$f":"Vragenlijst!AE425","v":0},{"$f":"IF(Vragenlijst!AU425=TRUE,\"loopt door\",IF(Vragenlijst!AK425=\"\",0,CONCATENATE(\"gestopt in \",Vragenlijst!AK425)))","v":0}]
[{"$f":"$A$2","v":1001},"2025","00:00:00",{"$f":"Vragenlijst!C426","v":0},{"$f":"Vragenlijst!AE426","v":0},{"$f":"IF(Vragenlijst!AU426=TRUE,\"loopt door\",IF(Vragenlijst!AK426=\"\",0,CONCATENATE(\"gestopt in \",Vragenlijst!AK426)))","v":0}]
[1001,"2025","00:00:00",{"$f":"Vragenlijst!C427","v":0},{"$f":"Vragenlijst!AE427","v":0},{"$f":"IF(Vragenlijst!AU427=TRUE,\"loopt door\",IF(Vragenlijst!AK427=\"\",0,CONCATENATE(\"gestopt in \",Vragenlijst!AK427)))","v":0}]
[1001,"2025","00:00:00",{"$f":"Vragenlijst!C428","v":0},{"$f":"Vragenlijst!AE428","v":0},{"$f":"IF(Vragenlijst!AU428=TRUE,\"loopt door\",IF(Vragenlijst!AK428=\"\",0,CONCATENATE(\"gestopt in \",Vragenlijst!AK428)))","v":0}]
[1001,"2025","00:00:00",{"$f":"Vragenlijst!C429","v":0},{"$f":"Vragenlijst!AE429","v":0},{"$f":"IF(Vragenlijst!AU429=TRUE,\"loopt door\",IF(Vragenlijst!AK429=\"\",0,CONCATENATE(\"gestopt in \",Vragenlijst!AK429)))","v":0}]
[1001,"2025","00:00:00",{"$f":"Vragenlijst!C430","v":0},{"$f":"Vragenlijst!AE430","v":0},{"$f":"IF(Vragenlijst!AU430=TRUE,\"loopt door\",IF(Vragenlijst!AK430=\"\",0,CONCATENATE(\"gestopt in \",Vragenlijst!AK430)))","v":0}]
[1001,"2025","00:00:00",{"$f":"Vragenlijst!C431","v":0},{"$f":"Vragenlijst!AE431","v":0},{"$f":"IF(Vragenlijst!AU431=TRUE,\"loopt door\",IF(Vragenlijst!AK431=\"\",0,CONCATENATE(\"gestopt in \",Vragenlijst!AK431)))","v":0}]
[]
[]
["Economisch"]
["id_CA","RapportJaar","invuldatum","Q39_Cursussen","Q39_BezorgParticulieren","Q39_Exposities","Q39_Horeca","Q39_Lespaketten","Q39_LogistiekeServicesIntern","Q39_OphaalParticulieren","Q39_Reparatieservice","Q39_Rondleidingen","Q39_Teambuilding","Q39_Uitleen","Q39_VerhuurRuimtes","Q39_VerhuurWerkplaatsen","Q39_Verkoop2deHands","Q39_Webshop","Q39_Weggeefwinkel","Q39_Anders1","Q39_Anders2","Q39_Anders3","Q39_Anders4","Q39_AndersNamelijk1","Q39_AndersNamelijk2","Q39_AndersNamelijk3","Q39_AndersNamelijk4","Q40_Economisch",{"$f":"CONCATENATE(\"Q41_JaIenW_RWS\",$B$202)","v":"Q41_JaIenW_RWS2025"},{"$f":"CONCATENATE(\"Q41_JaRijk\",$B$202)","v":"Q41_JaRijk2025"},{"$f":"CONCATENATE(\"Q41_JaProvincie\",$B$202)","v":"Q41_JaProvincie2025"},{"$f":"CONCATENATE(\"Q41_JaGemeente\",$B$202)","v":"Q41_JaGemeente2025"},{"$f":"CONCATENATE(\"Q41_JaEU\",$B$202)","v":"Q41_JaEU2025"},{"$f":"CONCATENATE(\"Q41_JaGoedeDoelen_Stichtingen\",$B$202)","v":"Q41_JaGoedeDoelen_Stichtingen2025"},{"$f":"CONCATENATE(\"Q41_Nee\",$B$202)","v":"Q41_Nee2025"},{"$f":"CONCATENATE(\"Q41_AndersNamelijk\",$B$202)","v":"Q41_AndersNamelijk2025"},{"$f":"CONCATENATE(\"Q41_Anders\",$B$202)","v":"Q41_Anders2025"},"Q42_JaIenW_RWSverleden","Q42_JaRijkVerleden","Q42_JaProvincieVerleden","Q42_JaGemeenteVerleden","Q42_JaEUverleden","Q42_Ja_GoedeDoelen_Stichtingen","Q42_NeeVerleden","Q42_Anders","Q42_AndersNamelijk","Q43_SubAfhOpstarten","Q43_SubAfhOntwikkeling","Q43_SubAfhOnderzoek","Q43_SubAfhBestaan","Q44_BorgingFinanz5Jaar","Q44_BorgingFinanzKorteTermijn","Q44_BorgingFinanzBezig","Q44_BorgingFinanz1JaarPlan","Q44_BorgingFinanzNietNagedacht","Q44_BorgingFinanzAnders","Q44_BorgingFinanzAndersNamelijk","Q45_ValueCaseDeelname","Q46_ToepassingValueCaseLabel","Q46_ToepassingValueCaseText"]
[{"$f":"$A$2","v":1001},{"$f":"$B$6","v":"2025"},{"$f":"$C$6","v":"00:00:00"},{"$f":"Vragenlijst!AU538","v":0},{"$f":"Vragenlijst!AU539","v":0},{"$f":"Vragenlijst!AU540","v":0},{"$f":"Vragenlijst!AU541","v":0},{"$f":"Vragenlijst!AU542","v":0},{"$f":"Vragenlijst!AU543","v":0},{"$f":"Vragenlijst!AU544","v":0},{"$f":"Vragenlijst!AU545","v":0},{"$f":"Vragenlijst!AU546","v":0},{"$f":"Vragenlijst!AU547","v":0},{"$f":"Vragenlijst!AU548","v":0},{"$f":"Vragenlijst!AU549","v":0},{"$f":"Vragenlijst!AU550","v":0},{"$f":"Vragenlijst!AU551","v":0},{"$f":"Vragenlijst!AU552","v":0},{"$f":"Vragenlijst!AU553","v":0},{"$f":"Vragenlijst!AU554","v":0},{"$f":"Vragenlijst!AU555","v":0},{"$f":"Vragenlijst!AU556","v":0},{"$f":"Vragenlijst!AU557","v":0},{"$f":"Vragenlijst!I554","v":0},{"$f":"Vragenlijst!I555","v":0},{"$f":"Vragenlijst!I556","v":0},{"$f":"Vragenlijst!I557","v":0},{"$f":"IF(Vragenlijst!AU572=TRUE,\"geen gegevens\",\"wel gegevens\")","v":"wel gegevens"},{"$f":"Vragenlijst!AU576","v":0},{"$f":"Vragenlijst!AU577","v":0},{"$f":"Vragenlijst!AU578","v":0},{"$f":"Vragenlijst!AU579","v":0},{"$f":"Vragenlijst!AU580","v":0},{"$f":"Vragenlijst!AU581","v":0},{"$f":"Vragenlijst!AU582","v":0},{"$f":"Vragenlijst!AU583","v":0},{"$f":"Vragenlijst!I583","v":0},{"$f":"Vragenlijst!AU588","v":0},{"$f":"Vragenlijst!AU589","v":0},{"$f":"Vragenlijst!AU590","v":0},{"$f":"Vragenlijst!AU591","v":0},{"$f":"Vragenlijst!AU592","v":0},{"$f":"Vragenlijst!AU593","v":0},{"$f":"Vragenlijst!AU594","v":0},{"$f":"Vragenlijst!AU595","v":0},{"$f":"Vragenlijst!I595","v":0},{"$f":"Vragenlijst!L601","v":0},{"$f":"Vragenlijst!L602","v":0},{"$f":"Vragenlijst!L603","v":0},{"$f":"Vragenlijst!L604","v":0},{"$f":"Vragenlijst!AT608","v":0},{"$f":"Vragenlijst!AT609","v":0},{"$f":"Vragenlijst!AT610","v":0},{"$f":"Vragenlijst!AT611","v":0},{"$f":"Vragenlijst!AT612","v":0},{"$f":"Vragenlijst!AT613","v":0},{"$f":"Vragenlijst!I613","v":0},{"$f":"Vragenlijst!C617","v":0},0,{"$f":"VLOOKUP(BG202,sleutels!A49:B52,2,FALSE)","v":{"$error":"#N/A"}}]
[]
[]
["id_CA","RapportJaar","invuldatum","Q40_OndernemendePartner","Q40_B2B","Q40_B2C"]
[{"$f":"$A$2","v":1001},{"$f":"$B$6","v":"2025"},{"$f":"$C$6","v":"00:00:00"},{"$f":"Vragenlijst!C566","v":0},{"$f":"Vragenlijst!K566","v":0},{"$f":"Vragenlijst!N566","v":0}]
[{"$f":"$A$2","v":1001},"2025","00:00:00",{"$f":"Vragenlijst!C567","v":0},{"$f":"Vragenlijst!K567","v":0},{"$f":"Vragenlijst!N567","v":0}]
[1001,"2025","00:00:00",{"$f":"Vragenlijst!C568","v":0},{"$f":"Vragenlijst!K568","v":0},{"$f":"Vragenlijst!N568","v":0}]
[1001,"2025","00:00:00",{"$f":"Vragenlijst!C569","v":0},{"$f":"Vragenlijst!K569","v":0},{"$f":"Vragenlijst!N569","v":0}]
[{"$f":"$A$2","v":1001},"2025","00:00:00",{"$f":"Vragenlijst!C570","v":0},{"$f":"Vragenlijst!K570","v":0},{"$f":"Vragenlijst!N570","v":0}]
[]
[]
["Bekendheid bij publiek"]
["id_CA","RapportJaar","invuldatum","Q47_OnlinePresentie","Q47_Opmerking",{"$f":"CONCATENATE(\"Q48_AantalBerichten\",B215-1)","v":"Q48_AantalBerichten2024"},{"$f":"CONCATENATE(\"Q48_AantalBerichten\",B215)","v":"Q48_AantalBerichten2025"},"Q48_Opmerking","Q49_InputBekendheid"]
[{"$f":"$A$2","v":1001},{"$f":"$B$6","v":"2025"},{"$f":"$C$6","v":"00:00:00"},{"$f":"IF(Vragenlijst!AU640=TRUE,\"nee\",\"ja\")","v":"ja"},{"$f":"Vragenlijst!C643","v":0},{"$f":"IF(Vragenlijst!AU650,\"niet bekend\",Vragenlijst!L650)","v":0},{"$f":"IF(Vragenlijst!AU651,\"niet bekend\",Vragenlijst!L651)","v":0},{"$f":"Vragenlijst!C654","v":0},{"$f":"Vragenlijst!C661","v":0}]
[]
["id_CA","RapportJaar","invuldatum","Q47_TypePresentie","Q47_bestaat","Q47_Link","Q47_Bezoekers/Volgers"]
[{"$f":"$A$2","v":1001},{"$f":"$B$6","v":"2025"},{"$f":"$C$6","v":"00:00:00"},"Eigen website",{"$f":"Vragenlijst!AU635","v":0},{"$f":"Vragenlijst!L635","v":0},{"$f":"IF(Vragenlijst!AW635,\"niet bekend\",Vragenlijst!AC635)","v":0}]
[{"$f":"$A$2","v":1001},"2025","00:00:00","Facebook",{"$f":"Vragenlijst!AU636","v":0},{"$f":"Vragenlijst!L636","v":0},{"$f":"IF(Vragenlijst!AW636,\"niet bekend\",Vragenlijst!AC636)","v":0}]
[{"$f":"$A$2","v":1001},"2025","00:00:00","Instagram",{"$f":"Vragenlijst!AU637","v":0},{"$f":"Vragenlijst!L637","v":0},{"$f":"IF(Vragenlijst!AW637,\"niet bekend\",Vragenlijst!AC637)","v":0}]
[{"$f":"$A$2","v":1001},"2025","00:00:00","X",{"$f":"Vragenlijst!AU638","v":0},{"$f":"Vragenlijst!L638","v":0},{"$f":"IF(Vragenlijst!AW638,\"niet bekend\",Vragenlijst!AC638)","v":0}]
[{"$f":"$A$2","v":1001},"2025","00:00:00","LinkedIn",{"$f":"Vragenlijst!AU639","v":0},{"$f":"Vragenlijst!L639","v":0},{"$f":"IF(Vragenlijst!AW639,\"niet bekend\",Vragenlijst!AC639)","v":0}]
[]
[]
[]
[]
["Terugkoppeling en benchmark"]
["id_CA","RapportJaar","invuldatum","Q50_InteressBenchmark","Q51_Type","Q51_Ontwikkelstadium","Q51_Stedelijkheidsklasse","Q51_Provincie","Q51_Anders1","Q51_Anders2","Q51_Anders3","Q51_AndersNamelijk1","Q51_AndersNamelijk2","Q51_AndersNamelijk3","Q52_AanvullendeGegevens","Q53_AanvullendeGegevensDelen","Q54_Feedback"]
[{"$f":"$A$2","v":1001},{"$f":"$B$6","v":"2025"},{"$f":"$C$6","v":"00:00:00"},{"$f":"Vragenlijst!C672","v":0},{"$f":"Vragenlijst!AU676","v":0},{"$f":"Vragenlijst!AU677","v":0},{"$f":"Vragenlijst!AU678","v":0},{"$f":"Vragenlijst!AU679","v":0},{"$f":"Vragenlijst!AU680","v":0},{"$f":"Vragenlijst!AU681","v":0},{"$f":"Vragenlijst!AU682","v":0},{"$f":"Vragenlijst!K680","v":0},{"$f":"Vragenlijst!K681","v":0},{"$f":"Vragenlijst!K682","v":0},{"$f":"Vragenlijst!C693","v":0},{"$f":"Vragenlijst!C699","v":0},{"$f":"Vragenlijst!C708","v":0}]

{"sheet":"hulp","index":5,"n_rows":4,"n_cols":4,"rows_kept":4,"cut":false,"hidden":true,"merged":[]}
[]
[null,"kringloopwinkels overzicht",null,"soicale partners overzicht"]
[]
[null,{"$f":"_xlfn._xlws.FILTER(data!H17:H116,data!H17:H116<>\"\")","v":{"$error":"#VALUE!"}},null,{"$f":"_xlfn._xlws.FILTER(data!K17:K116,data!K17:K116<>\"\")","v":{"$error":"#VALUE!"}}]

{"sheet":"sleutels","index":6,"n_rows":52,"n_cols":2,"rows_kept":52,"cut":false,"hidden":true,"merged":[]}
[]
["ontwikkelstadium_id"]
[1,"Richten"]
[2,"Inrichten"]
[3,"Verrichten"]
[4,"Gevorderd"]
[]
[]
["structuur"]
[1,"Alle bouwstenen zijn op eén locatie"]
[2,"De bouwstenen zijn verdeeld op meerdere locaties (netwerk)"]
[3,"Nog niet bekend"]
[4,"Anders, namelijk "]
[5,"Weet niet"]
[]
[]
["Bouwstenen"]
[1,"Milieustraat "]
[2,"Kringloopwinkel"]
[3,"Repair Café/\nReparatie-werkplaats"]
[4,"Sociaal-maatschappelijke instelling"]
[5,"Onderwijsinstelling"]
[6,"Werkplaats en/of makersplaats"]
[7,"Initiatieven voor de deeleconomie"]
[8,"Ondernemers die hergebruiken of repareren"]
[9,"Demontage"]
[10,"Alternatief element"]
[11,"nvt"]
[]
["type sociaal"]
[1,"Werkontwikkelbedrijf"]
[2,"Sociale ondernemer"]
[3,"Welzijnsorganisatie"]
[]
[]
["Openingstijden"]
[1,"Fulltime"]
[2,"Een aantal uur per week"]
[3,"Een aantal uur per maand"]
[]
["Borging financering"]
[1,"De structurele financering is geborgd voor de komende 5 jaar"]
[2,"De structurele financering is alleen voor de korte termijn geborgd en nog niet voor de komende 5 jaar"]
[3,"We zijn bezig om de structurele financering vorm te geven"]
[4,"We plannen maar 1 jaar voorruit"]
[5,"We hebben daar nog niet over nagedacht"]
[]
["toepassen value case"]
[1,"ja"]
[2,"Ja, maar anders dan in de cursus"]
[3,"nee"]
[4,"niet van toepassing"]

{"sheet":"dataTotaal","index":7,"n_rows":2,"n_cols":221,"rows_kept":2,"cut":false,"hidden":true,"merged":[]}
[{"$f":"data!A5","v":"id_CA"},{"$f":"data!B5","v":"RapportJaar"},{"$f":"data!C5","v":"invuldatum"},{"$f":"data!D5","v":"Q02_ContactNaam"},{"$f":"data!E5","v":"Q02_ContactEmail"},{"$f":"data!F5","v":"Q02_ContactFunctie"},{"$f":"data!G5","v":"Q02_ContactWerkgev"},{"$f":"data!D11","v":"Q03_OntwikkelStadium"},{"$f":"data!E11","v":"Q04_Gemeente1"},{"$f":"data!F11","v":"Q04_Gemeente2"},{"$f":"data!G11","v":"Q04_Gemeente3"},{"$f":"data!H11","v":"Q04_Gemeente4"},{"$f":"data!I11","v":"Q04_Gemeente5"},{"$f":"data!J11","v":"Q04_Gemeente6"},{"$f":"data!K11","v":"Q04_Gemeente7"},{"$f":"data!L11","v":"Q04_Gemeente8"},{"$f":"data!M11","v":"Q05_Doelstelling1"},{"$f":"data!N11","v":"Q05_Doelstelling2"},{"$f":"data!O11","v":"Q05_Doelstelling3"},{"$f":"data!P11","v":"Q05_Doelstelling4"},{"$f":"data!Q11","v":"Q05_Doelstelling5"},{"$f":"data!R11","v":"Q05_GeenDoelstelling"},{"$f":"data!S11","v":"Q06_ToegevoegdeWaardeCA"},{"$f":"data!T11","v":"Q07_structuur"},{"$f":"data!U11","v":"Q07_StructuurAndersNamelijk"},{"$f":"data!V11","v":"Q08_30+partners"},{"$f":"data!W11","v":"Q08_AantalPartners"},{"$f":"data!X11","v":"Q08_Milieustraat_aantal"},{"$f":"data!Y11","v":"Q08_Kringloopwinkel_aantal"},{"$f":"data!Z11","v":"Q08_Reparatie_aantal"},{"$f":"data!AA11","v":"Q08_Sociaal_aantal"},{"$f":"data!AB11","v":"Q08_Onderwijs_aantal"},{"$f":"data!AC11","v":"Q08_Werkplaats_aantal"},{"$f":"data!AD11","v":"Q08_deeleconomie_aantal"},{"$f":"data!AE11","v":"Q08_Ondernemers_aantal"},{"$f":"data!AF11","v":"Q08_Demontage_aantal"},{"$f":"data!AG11","v":"Q08_Alternatief_aantal"},{"$f":"data!AH11","v":"Q09_Milieustraat_aantal"},{"$f":"data!AI11","v":"Q09_Kringloopwinkel_aantal"},{"$f":"data!AJ11","v":"Q09_Reparatie_aantal"},{"$f":"data!AK11","v":"Q09_Sociaal_aantal"},{"$f":"data!AL11","v":"Q09_Onderwijs_aantal"},{"$f":"data!AM11","v":"Q09_Werkplaats_aantal"},{"$f":"data!AN11","v":"Q09_deeleconomie_aantal"},{"$f":"data!AO11","v":"Q09_Ondernemers_aantal"},{"$f":"data!AP11","v":"Q09_Demontage_aantal"},{"$f":"data!AQ11","v":"Q09_Alternatief_aantal"},{"$f":"data!AR11","v":"Q010_SamenwerkingWerkcentra"},{"$f":"data!D140","v":"Q13_AantalMilieustraten"},{"$f":"data!E140","v":"Q14_AantalMilieustratenCA"},{"$f":"data!F140","v":"Q14_OpmMilieust"},{"$f":"data!G140","v":"Q15_KringloopwinkelEerst"},{"$f":"data!H140","v":"Q15_PersoneelBeoordeelt"},{"$f":"data!I140","v":"Q15_ContainerHergebruikKringloop"},{"$f":"data!J140","v":"Q15_ContainerCirculaireOndernemers"},{"$f":"data!K140","v":"Q15_ContainerReparatie"},{"$f":"data!L140","v":"Q15_PersoneelSorteertHergebruik"},{"$f":"data!M140","v":"Q15_AndersMilieustraat"},{"$f":"data!N140","v":"Q15_Geen"},{"$f":"data!O140","v":"Q15_AndersNamelijk"},{"$f":"data!D148","v":"Q17_ReparatieWelOFNIET"},{"$f":"data!E148","v":"Q18_ReparatieGratisOfDonatie"},{"$f":"data!F148","v":"Q18_ReparatieBetaald"},{"$f":"data!G148","v":"Q18_Opmerking"},{"$f":"data!H148","v":"Q19_Afgeven"},{"$f":"data!I148","v":"Q19_SamenRepareren"},{"$f":"data!J148","v":"Q19_Keuze"},{"$f":"data!K148","v":"Q19_Opmerking"},{"$f":"data!L148","v":"Q20_AantalLocatiesRepairCafe"},{"$f":"data!M148","v":"Q21_Openingstijden"},{"$f":"data!N148","v":"Q21_UrenPerWeek/Maand"},{"$f":"data!O148","v":"Q21_AantalUren"},{"$f":"data!P148","v":"Q21_OpmerkingReparatieOpeningstijden"},{"$f":"data!Q148","v":"Q22_DigitaalEigenAdmin"},{"$f":"data!R148","v":"Q22_DigitaalRepairmonitor"},{"$f":"data!S148","v":"Q22_FysiekBoek"},{"$f":"data!T148","v":"Q22_GeenAdmin"},{"$f":"data!U148","v":"Q22_OpmAdmin"},{"$f":"data!V148","v":"Q23_InitiatiefReparatie"},{"$f":"data!W148","v":"Q24_RepInitiatievenStopReden1"},{"$f":"data!X148","v":"Q24_RepInitiatievenStopReden2"},{"$f":"data!Y148","v":"Q24_RepInitiatievenStopReden3"},{"$f":"data!Z148","v":"Q24_RepInitiatievenStopReden4"},{"$f":"data!AA148","v":"Q243_RepInitiatievenStopReden5"},{"$f":"data!AB148","v":"Q24_RepInitiatievenStopReden6"},{"$f":"data!D177","v":"Q25_Basisonderwijs"},{"$f":"data!E177","v":"Q25_SpeciaalOnderwijs"},{"$f":"data!F177","v":"Q25_Praktijkonderwijs"},{"$f":"data!G177","v":"Q25_VMBO"},{"$f":"data!H177","v":"Q25_HAVO"},{"$f":"data!I177","v":"Q25_VWO"},{"$f":"data!J177","v":"Q25_Volwasseneneducatie"},{"$f":"data!K177","v":"Q25_MBO"},{"$f":"data!L177","v":"Q25_HBO"},{"$f":"data!M177","v":"Q25_Universiteit"},{"$f":"data!N177","v":"Q25WOB"},{"$f":"data!O177","v":"Q25_Anders"},{"$f":"data!P177","v":"Q25_Anders_namelijk"},{"$f":"data!Q177","v":"Q25_Geen"},{"$f":"data!R177","v":"Q25_Opmerking"},{"$f":"data!S177","v":"Q26_HergebruikProducten"},{"$f":"data!T177","v":"Q26_Reparatie"},{"$f":"data!U177","v":"Q26_DemontageOnderdelen"},{"$f":"data!V177","v":"Q26_UpcyclingHergebruikMaterialen"},{"$f":"data!W177","v":"Q26_RefurbishProducten"},{"$f":"data!X177","v":"Q26_DemontageVoorRecycling"},{"$f":"data!Y177","v":"Q26_NogNiet"},{"$f":"data!Z177","v":"Q26_Opmerking"},{"$f":"data!AA177","v":"Q27_Textiel"},{"$f":"data!AB177","v":"Q27_Elektrische apparaten"},{"$f":"data!AC177","v":"Q27_Meubels"},{"$f":"data!AD177","v":"Q27_Anders"},{"$f":"data!AE177","v":"Q27_AndersNamelijk"},{"$f":"data!AF177","v":"Q28_ScholierenStudenten"},{"$f":"data!AG177","v":"Q28_VervolgopleidingVolwassenen"},{"$f":"data!AH177","v":"Q28_MedewerkendeRepaircafe"},{"$f":"data!AI177","v":"Q28_MedewerkendeRepairwerkplaats"},{"$f":"data!AJ177","v":"Q28_SWpersoneel"},{"$f":"data!AK177","v":"Q28_ParticulierenInwoners"},{"$f":"data!AL177","v":"Q28_Anders"},{"$f":"data!AM177","v":"Q28_AndersNamelijk"},{"$f":"data!D182","v":"Q29_MensenZonderWerk"},{"$f":"data!E182","v":"Q29_MensenMetArbeidsuitdaging"},{"$f":"data!F182","v":"Q29_MensenInOpleiding"},{"$f":"data!G182","v":"Q29_MensenOpZoekNaarVeiligheid"},{"$f":"data!H182","v":"Q29_VrijwilligersEnOverig"},{"$f":"data!I182","v":"Q29_OverigBetaaldeMedewerkers"},{"$f":"data!J182","v":"Q30_Doorstroom"},{"$f":"data!K182","v":"Q31_InitiatiefSA"},{"$f":"data!L182","v":"Q32_IWInitiatievenStopReden1"},{"$f":"data!M182","v":"Q32_IWInitiatievenStopReden2"},{"$f":"data!N182","v":"Q32_IWInitiatievenStopReden3"},{"$f":"data!O182","v":"Q32_IWInitiatievenStopReden4"},{"$f":"data!P182","v":"Q32_IWInitiatievenStopReden5"},{"$f":"data!Q182","v":"Q32_IWInitiatievenStopReden6"},{"$f":"data!R182","v":"Q33_Vrijwilligers"},{"$f":"data!S182","v":"Q36_FTE-PSO2024"},{"$f":"data!T182","v":"Q36_FTE-PSO2025"},{"$f":"data!U182","v":"Q36_Opmerking"},{"$f":"data!V182","v":"Q37_AantalPersonenWOB2024"},{"$f":"data!W182","v":"Q37_AantalPersonenWOB2025"},{"$f":"data!X182","v":"Q38_AantalLWT"},{"$f":"data!Y182","v":"Q38_LOT_WOB_perc"},{"$f":"data!Z182","v":"Q38_LOT_LS_perc"},{"$f":"data!D201","v":"Q39_Cursussen"},{"$f":"data!E201","v":"Q39_BezorgParticulieren"},{"$f":"data!F201","v":"Q39_Exposities"},{"$f":"data!G201","v":"Q39_Horeca"},{"$f":"data!H201","v":"Q39_Lespaketten"},{"$f":"data!I201","v":"Q39_LogistiekeServicesIntern"},{"$f":"data!J201","v":"Q39_OphaalParticulieren"},{"$f":"data!K201","v":"Q39_Reparatieservice"},{"$f":"data!L201","v":"Q39_Rondleidingen"},{"$f":"data!M201","v":"Q39_Teambuilding"},{"$f":"data!N201","v":"Q39_Uitleen"},{"$f":"data!O201","v":"Q39_VerhuurRuimtes"},{"$f":"data!P201","v":"Q39_VerhuurWerkplaatsen"},{"$f":"data!Q201","v":"Q39_Verkoop2deHands"},{"$f":"data!R201","v":"Q39_Webshop"},{"$f":"data!S201","v":"Q39_Weggeefwinkel"},{"$f":"data!T201","v":"Q39_Anders1"},{"$f":"data!U201","v":"Q39_Anders2"},{"$f":"data!V201","v":"Q39_Anders3"},{"$f":"data!W201","v":"Q39_Anders4"},{"$f":"data!X201","v":"Q39_AndersNamelijk1"},{"$f":"data!Y201","v":"Q39_AndersNamelijk2"},{"$f":"data!Z201","v":"Q39_AndersNamelijk3"},{"$f":"data!AA201","v":"Q39_AndersNamelijk4"},{"$f":"data!AB201","v":"Q40_Economisch"},{"$f":"data!AC201","v":"Q41_JaIenW_RWS2025"},{"$f":"data!AD201","v":"Q41_JaRijk2025"},{"$f":"data!AE201","v":"Q41_JaProvincie2025"},{"$f":"data!AF201","v":"Q41_JaGemeente2025"},{"$f":"data!AG201","v":"Q41_JaEU2025"},{"$f":"data!AH201","v":"Q41_JaGoedeDoelen_Stichtingen2025"},{"$f":"data!AI201","v":"Q41_Nee2025"},{"$f":"data!AJ201","v":"Q41_AndersNamelijk2025"},{"$f":"data!AK201","v":"Q41_Anders2025"},{"$f":"data!AL201","v":"Q42_JaIenW_RWSverleden"},{"$f":"data!AM201","v":"Q42_JaRijkVerleden"},{"$f":"data!AN201","v":"Q42_JaProvincieVerleden"},{"$f":"data!AO201","v":"Q42_JaGemeenteVerleden"},{"$f":"data!AP201","v":"Q42_JaEUverleden"},{"$f":"data!AQ201","v":"Q42_Ja_GoedeDoelen_Stichtingen"},{"$f":"data!AR201","v":"Q42_NeeVerleden"},{"$f":"data!AS201","v":"Q42_Anders"},{"$f":"data!AT201","v":"Q42_AndersNamelijk"},{"$f":"data!AU201","v":"Q43_SubAfhOpstarten"},{"$f":"data!AV201","v":"Q43_SubAfhOntwikkeling"},{"$f":"data!AW201","v":"Q43_SubAfhOnderzoek"},{"$f":"data!AX201","v":"Q43_SubAfhBestaan"},{"$f":"data!AY201","v":"Q44_BorgingFinanz5Jaar"},{"$f":"data!AZ201","v":"Q44_BorgingFinanzKorteTermijn"},{"$f":"data!BA201","v":"Q44_BorgingFinanzBezig"},{"$f":"data!BB201","v":"Q44_BorgingFinanz1JaarPlan"},{"$f":"data!BC201","v":"Q44_BorgingFinanzNietNagedacht"},{"$f":"data!BD201","v":"Q44_BorgingFinanzAnders"},{"$f":"data!BE201","v":"Q44_BorgingFinanzAndersNamelijk"},{"$f":"data!BF201","v":"Q45_ValueCaseDeelname"},{"$f":"data!BG201","v":"Q46_ToepassingValueCaseLabel"},{"$f":"data!BH201","v":"Q46_ToepassingValueCaseText"},{"$f":"data!D214","v":"Q47_OnlinePresentie"},{"$f":"data!E214","v":"Q47_Opmerking"},{"$f":"data!F214","v":"Q48_AantalBerichten2024"},{"$f":"data!G214","v":"Q48_AantalBerichten2025"},{"$f":"data!H214","v":"Q48_Opmerking"},{"$f":"data!I214","v":"Q49_InputBekendheid"},{"$f":"data!D228","v":"Q50_InteressBenchmark"},{"$f":"data!E228","v":"Q51_Type"},{"$f":"data!F228","v":"Q51_Ontwikkelstadium"},{"$f":"data!G228","v":"Q51_Stedelijkheidsklasse"},{"$f":"data!H228","v":"Q51_Provincie"},{"$f":"data!I228","v":"Q51_Anders1"},{"$f":"data!J228","v":"Q51_Anders2"},{"$f":"data!K228","v":"Q51_Anders3"},{"$f":"data!L228","v":"Q51_AndersNamelijk1"},{"$f":"data!M228","v":"Q51_AndersNamelijk2"},{"$f":"data!N228","v":"Q51_AndersNamelijk3"},{"$f":"data!O228","v":"Q52_AanvullendeGegevens"},{"$f":"data!P228","v":"Q53_AanvullendeGegevensDelen"},{"$f":"data!Q228","v":"Q54_Feedback"}]
[{"$f":"data!A6","v":1001},{"$f":"data!B6","v":"2025"},{"$f":"data!C6","v":0},{"$f":"data!D6","v":0},{"$f":"data!E6","v":0},{"$f":"data!F6","v":0},{"$f":"data!G6","v":0},{"$f":"VLOOKUP(data!D12,sleutels!A3:B6,2,FALSE)","v":{"$error":"#N/A"}},{"$f":"data!E12","v":0},{"$f":"data!F12","v":0},{"$f":"data!G12","v":0},{"$f":"data!H12","v":0},{"$f":"data!I12","v":0},{"$f":"data!J12","v":0},{"$f":"data!K12","v":0},{"$f":"data!L12","v":0},{"$f":"data!M12","v":0},{"$f":"data!N12","v":0},{"$f":"data!O12","v":0},{"$f":"data!P12","v":0},{"$f":"data!Q12","v":0},{"$f":"data!R12","v":0},{"$f":"data!S12","v":0},{"$f":"VLOOKUP(data!T12,sleutels!A10:B14,2,FALSE)","v":{"$error":"#N/A"}},{"$f":"data!U12","v":0},{"$f":"data!V12","v":0},{"$f":"data!W12","v":0},{"$f":"data!X12","v":0},{"$f":"data!Y12","v":0},{"$f":"data!Z12","v":0},{"$f":"data!AA12","v":0},{"$f":"data!AB12","v":0},{"$f":"data!AC12","v":0},{"$f":"data!AD12","v":0},{"$f":"data!AE12","v":0},{"$f":"data!AF12","v":0},{"$f":"data!AG12","v":0},{"$f":"data!AH12","v":0},{"$f":"data!AI12","v":0},{"$f":"data!AJ12","v":0},{"$f":"data!AK12","v":0},{"$f":"data!AL12","v":0},{"$f":"data!AM12","v":0},{"$f":"data!AN12","v":0},{"$f":"data!AO12","v":0},{"$f":"data!AP12","v":0},{"$f":"data!AQ12","v":0},{"$f":"data!AR12","v":0},{"$f":"data!D141","v":0},{"$f":"data!E141","v":0},{"$f":"data!F141","v":0},{"$f":"data!G141","v":0},{"$f":"data!#REF!","v":{"$error":"#REF!"}},{"$f":"data!#REF!","v":{"$error":"#REF!"}},{"$f":"data!#REF!","v":{"$error":"#REF!"}},{"$f":"data!#REF!","v":{"$error":"#REF!"}},{"$f":"data!#REF!","v":{"$error":"#REF!"}},{"$f":"data!#REF!","v":{"$error":"#REF!"}},{"$f":"data!#REF!","v":{"$error":"#REF!"}},{"$f":"data!O141","v":0},{"$f":"data!D149","v":0},{"$f":"data!E149","v":0},{"$f":"data!#REF!","v":{"$error":"#REF!"}},{"$f":"data!G149","v":0},{"$f":"data!H149","v":0},{"$f":"data!#REF!","v":{"$error":"#REF!"}},{"$f":"data!#REF!","v":{"$error":"#REF!"}},{"$f":"data!K149","v":0},{"$f":"data!L149","v":0},{"$f":"VLOOKUP(data!M149,sleutels!A37:B39,2,FALSE)","v":{"$error":"#N/A"}},{"$f":"data!N149","v":""},{"$f":"data!O149","v":0},{"$f":"data!P149","v":0},{"$f":"data!Q149","v":0},{"$f":"data!R149","v":0},{"$f":"data!S149","v":0},{"$f":"data!T149","v":0},{"$f":"data!U149","v":0},{"$f":"data!V149","v":"ja"},{"$f":"data!W149","v":0},{"$f":"data!X149","v":0},{"$f":"data!Y149","v":0},{"$f":"data!Z149","v":0},{"$f":"data!AA149","v":0},{"$f":"data!AB149","v":0},{"$f":"data!D178","v":0},{"$f":"data!E178","v":0},{"$f":"data!F178","v":0},{"$f":"data!G178","v":0},{"$f":"data!H178","v":0},{"$f":"data!I178","v":0},{"$f":"data!J178","v":0},{"$f":"data!K178","v":0},{"$f":"data!L178","v":0},{"$f":"data!M178","v":0},{"$f":"data!N178","v":0},{"$f":"data!O178","v":0},{"$f":"data!P178","v":0},{"$f":"data!Q178","v":0},{"$f":"data!R178","v":0},{"$f":"data!S178","v":0},{"$f":"data!T178","v":0},{"$f":"data!U178","v":0},{"$f":"data!V178","v":0},{"$f":"data!W178","v":0},{"$f":"data!X178","v":0},{"$f":"data!Y178","v":0},{"$f":"data!Z178","v":0},{"$f":"data!AA178","v":0},{"$f":"data!AB178","v":0},{"$f":"data!AC178","v":0},{"$f":"data!AD178","v":0},{"$f":"data!AE178","v":0},{"$f":"data!AF178","v":0},{"$f":"data!AG178","v":0},{"$f":"data!AH178","v":0},{"$f":"data!AI178","v":0},{"$f":"data!AJ178","v":0},{"$f":"data!AK178","v":0},{"$f":"data!AL178","v":0},{"$f":"data!AM178","v":0},{"$f":"data!D183","v":0},{"$f":"data!E183","v":0},{"$f":"data!F183","v":0},{"$f":"data!G183","v":0},{"$f":"data!H183","v":0},{"$f":"data!I183","v":0},{"$f":"data!J183","v":0},{"$f":"data!K183","v":"ja"},{"$f":"data!L183","v":"nvt"},{"$f":"data!M183","v":0},{"$f":"data!N183","v":0},{"$f":"data!O183","v":0},{"$f":"data!P183","v":0},{"$f":"data!Q183","v":0},{"$f":"data!R183","v":true},{"$f":"data!S183","v":0},{"$f":"data!T183","v":0},{"$f":"data!U183","v":0},{"$f":"data!V183","v":"onbekend"},{"$f":"data!W183","v":"onbekend"},{"$f":"data!X183","v":"onbekend"},{"$f":"data!Y183","v":0},{"$f":"data!Z183","v":0},{"$f":"data!D202","v":0},{"$f":"data!#REF!","v":{"$error":"#REF!"}},{"$f":"data!#REF!","v":{"$error":"#REF!"}},{"$f":"data!#REF!","v":{"$error":"#REF!"}},{"$f":"data!#REF!","v":{"$error":"#REF!"}},{"$f":"data!#REF!","v":{"$error":"#REF!"}},{"$f":"data!#REF!","v":{"$error":"#REF!"}},{"$f":"data!#REF!","v":{"$error":"#REF!"}},{"$f":"data!#REF!","v":{"$error":"#REF!"}},{"$f":"data!#REF!","v":{"$error":"#REF!"}},{"$f":"data!#REF!","v":{"$error":"#REF!"}},{"$f":"data!#REF!","v":{"$error":"#REF!"}},{"$f":"data!#REF!","v":{"$error":"#REF!"}},{"$f":"data!#REF!","v":{"$error":"#REF!"}},{"$f":"data!#REF!","v":{"$error":"#REF!"}},{"$f":"data!#REF!","v":{"$error":"#REF!"}},{"$f":"data!#REF!","v":{"$error":"#REF!"}},{"$f":"data!#REF!","v":{"$error":"#REF!"}},{"$f":"data!#REF!","v":{"$error":"#REF!"}},{"$f":"data!#REF!","v":{"$error":"#REF!"}},{"$f":"data!X202","v":0},{"$f":"data!Y202","v":0},{"$f":"data!Z202","v":0},{"$f":"data!AA202","v":0},{"$f":"data!AB202","v":"wel gegevens"},{"$f":"data!AC202","v":0},{"$f":"data!#REF!","v":{"$error":"#REF!"}},{"$f":"data!#REF!","v":{"$error":"#REF!"}},{"$f":"data!#REF!","v":{"$error":"#REF!"}},{"$f":"data!#REF!","v":{"$error":"#REF!"}},{"$f":"data!#REF!","v":{"$error":"#REF!"}},{"$f":"data!#REF!","v":{"$error":"#REF!"}},{"$f":"data!#REF!","v":{"$error":"#REF!"}},{"$f":"data!AK202","v":0},{"$f":"data!AL202","v":0},{"$f":"data!#REF!","v":{"$error":"#REF!"}},{"$f":"data!#REF!","v":{"$error":"#REF!"}},{"$f":"data!#REF!","v":{"$error":"#REF!"}},{"$f":"data!#REF!","v":{"$error":"#REF!"}},{"$f":"data!#REF!","v":{"$error":"#REF!"}},{"$f":"data!#REF!","v":{"$error":"#REF!"}},{"$f":"data!#REF!","v":{"$error":"#REF!"}},{"$f":"data!AT202","v":0},{"$f":"data!AU202","v":0},{"$f":"data!AV202","v":0},{"$f":"data!AW202","v":0},{"$f":"data!AX202","v":0},{"$f":"data!AY202","v":0},{"$f":"data!#REF!","v":{"$error":"#REF!"}},{"$f":"data!#REF!","v":{"$error":"#REF!"}},{"$f":"data!#REF!","v":{"$error":"#REF!"}},{"$f":"data!#REF!","v":{"$error":"#REF!"}},{"$f":"data!#REF!","v":{"$error":"#REF!"}},{"$f":"data!BE202","v":0},{"$f":"data!BF202","v":0},{"$f":"data!BG202","v":0},{"$f":"data!BH202","v":{"$error":"#N/A"}},{"$f":"data!D215","v":"ja"},{"$f":"data!E215","v":0},{"$f":"data!F215","v":0},{"$f":"data!G215","v":0},{"$f":"data!H215","v":0},{"$f":"data!I215","v":0},{"$f":"data!D229","v":0},{"$f":"data!E229","v":0},{"$f":"data!#REF!","v":{"$error":"#REF!"}},{"$f":"data!#REF!","v":{"$error":"#REF!"}},{"$f":"data!#REF!","v":{"$error":"#REF!"}},{"$f":"data!#REF!","v":{"$error":"#REF!"}},{"$f":"data!#REF!","v":{"$error":"#REF!"}},{"$f":"data!#REF!","v":{"$error":"#REF!"}},{"$f":"data!L229","v":0},{"$f":"data!M229","v":0},{"$f":"data!N229","v":0},{"$f":"data!O229","v":0},{"$f":"data!P229","v":0},{"$f":"data!Q229","v":0}]

{"sheet":"dataPartners","index":8,"n_rows":101,"n_cols":13,"rows_kept":101,"cut":false,"hidden":true,"merged":[]}
[{"$f":"data!Q16","v":"id_CA"},{"$f":"data!R16","v":"RapportJaar"},{"$f":"data!S16","v":"invuldatum"},{"$f":"data!T16","v":"Q08_NaamPartner"},{"$f":"data!U16","v":"Q08_PartnerID"},{"$f":"data!V16","v":"Q08_Bouwsteen1"},{"$f":"data!W16","v":"Q09_Bouwsteen2"},{"$f":"data!I16","v":"Q16_BKNlid"},{"$f":"data!J16","v":"Q33_Vrijwilligers"},{"$f":"data!L16","v":"A34_TypeSociaal"},{"$f":"data!M16","v":"Q35_LidVanCedris"},{"$f":"data!AB16","v":"Q42_B2B"},{"$f":"data!AC16","v":"Q42_B2C"}]
[{"$f":"data!Q17","v":{"$error":"#VALUE!"}},{"$f":"data!R17","v":0},{"$f":"data!S17","v":0},{"$f":"data!T17","v":0},{"$f":"data!U17","v":0},{"$f":"VLOOKUP(data!F17,sleutels!$A$18:$B$28,2,FALSE)","v":{"$error":"#N/A"}},{"$f":"VLOOKUP(data!G17,sleutels!$A$18:$B$28,2,FALSE)","v":{"$error":"#N/A"}},{"$f":"data!I17","v":""},{"$f":"data!J17","v":""},{"$f":"IF(data!L17=\"\",\"\",IF(data!L17=1,sleutels!$B$31,IF(data!L17=2,sleutels!$B$32,IF(data!L17=3,sleutels!$B$33))))","v":""},{"$f":"data!M17","v":""},{"$f":"data!AB17","v":0},{"$f":"data!AC17","v":0}]
[{"$f":"data!Q18","v":0},{"$f":"data!R18","v":0},{"$f":"data!S18","v":0},{"$f":"data!T18","v":0},{"$f":"data!U18","v":0},{"$f":"VLOOKUP(data!F18,sleutels!$A$18:$B$28,2,FALSE)","v":{"$error":"#N/A"}},{"$f":"VLOOKUP(data!G18,sleutels!$A$18:$B$28,2,FALSE)","v":{"$error":"#N/A"}},{"$f":"data!I18","v":""},{"$f":"data!J18","v":""},{"$f":"IF(data!L18=\"\",\"\",IF(data!L18=1,sleutels!$B$31,IF(data!L18=2,sleutels!$B$32,IF(data!L18=3,sleutels!$B$33))))","v":""},{"$f":"data!M18","v":""},{"$f":"data!AB18","v":0},{"$f":"data!AC18","v":0}]
[{"$f":"data!Q19","v":0},{"$f":"data!R19","v":0},{"$f":"data!S19","v":0},{"$f":"data!T19","v":0},{"$f":"data!U19","v":0},{"$f":"VLOOKUP(data!F19,sleutels!$A$18:$B$28,2,FALSE)","v":{"$error":"#N/A"}},{"$f":"VLOOKUP(data!G19,sleutels!$A$18:$B$28,2,FALSE)","v":{"$error":"#N/A"}},{"$f":"data!I19","v":""},{"$f":"data!J19","v":""},{"$f":"IF(data!L19=\"\",\"\",IF(data!L19=1,sleutels!$B$31,IF(data!L19=2,sleutels!$B$32,IF(data!L19=3,sleutels!$B$33))))","v":""},{"$f":"data!M19","v":""},{"$f":"data!AB19","v":0},{"$f":"data!AC19","v":0}]
[{"$f":"data!Q20","v":0},{"$f":"data!R20","v":0},{"$f":"data!S20","v":0},{"$f":"data!T20","v":0},{"$f":"data!U20","v":0},{"$f":"VLOOKUP(data!F20,sleutels!$A$18:$B$28,2,FALSE)","v":{"$error":"#N/A"}},{"$f":"VLOOKUP(data!G20,sleutels!$A$18:$B$28,2,FALSE)","v":{"$error":"#N/A"}},{"$f":"data!I20","v":""},{"$f":"data!J20","v":""},{"$f":"IF(data!L20=\"\",\"\",IF(data!L20=1,sleutels!$B$31,IF(data!L20=2,sleutels!$B$32,IF(data!L20=3,sleutels!$B$33))))","v":""},{"$f":"data!M20","v":""},{"$f":"data!AB20","v":0},{"$f":"data!AC20","v":0}]
[{"$f":"data!Q21","v":0},{"$f":"data!R21","v":0},{"$f":"data!S21","v":0},{"$f":"data!T21","v":0},{"$f":"data!U21","v":0},{"$f":"VLOOKUP(data!F21,sleutels!$A$18:$B$28,2,FALSE)","v":{"$error":"#N/A"}},{"$f":"VLOOKUP(data!G21,sleutels!$A$18:$B$28,2,FALSE)","v":{"$error":"#N/A"}},{"$f":"data!I21","v":""},{"$f":"data!J21","v":""},{"$f":"IF(data!L21=\"\",\"\",IF(data!L21=1,sleutels!$B$31,IF(data!L21=2,sleutels!$B$32,IF(data!L21=3,sleutels!$B$33))))","v":""},{"$f":"data!M21","v":""},{"$f":"data!AB21","v":0},{"$f":"data!AC21","v":0}]
[{"$f":"data!Q22","v":0},{"$f":"data!R22","v":0},{"$f":"data!S22","v":0},{"$f":"data!T22","v":0},{"$f":"data!U22","v":0},{"$f":"VLOOKUP(data!F22,sleutels!$A$18:$B$28,2,FALSE)","v":{"$error":"#N/A"}},{"$f":"VLOOKUP(data!G22,sleutels!$A$18:$B$28,2,FALSE)","v":{"$error":"#N/A"}},{"$f":"data!I22","v":""},{"$f":"data!J22","v":""},{"$f":"IF(data!L22=\"\",\"\",IF(data!L22=1,sleutels!$B$31,IF(data!L22=2,sleutels!$B$32,IF(data!L22=3,sleutels!$B$33))))","v":""},{"$f":"data!M22","v":""},{"$f":"data!AB22","v":0},{"$f":"data!AC22","v":0}]
[{"$f":"data!Q23","v":0},{"$f":"data!R23","v":0},{"$f":"data!S23","v":0},{"$f":"data!T23","v":0},{"$f":"data!U23","v":0},{"$f":"VLOOKUP(data!F23,sleutels!$A$18:$B$28,2,FALSE)","v":{"$error":"#N/A"}},{"$f":"VLOOKUP(data!G23,sleutels!$A$18:$B$28,2,FALSE)","v":{"$error":"#N/A"}},{"$f":"data!I23","v":""},{"$f":"data!J23","v":""},{"$f":"IF(data!L23=\"\",\"\",IF(data!L23=1,sleutels!$B$31,IF(data!L23=2,sleutels!$B$32,IF(data!L23=3,sleutels!$B$33))))","v":""},{"$f":"data!M23","v":""},{"$f":"data!AB23","v":0},{"$f":"data!AC23","v":0}]
[{"$f":"data!Q24","v":0},{"$f":"data!R24","v":0},{"$f":"data!S24","v":0},{"$f":"data!T24","v":0},{"$f":"data!U24","v":0},{"$f":"VLOOKUP(data!F24,sleutels!$A$18:$B$28,2,FALSE)","v":{"$error":"#N/A"}},{"$f":"VLOOKUP(data!G24,sleutels!$A$18:$B$28,2,FALSE)","v":{"$error":"#N/A"}},{"$f":"data!I24","v":""},{"$f":"data!J24","v":""},{"$f":"IF(data!L24=\"\",\"\",IF(data!L24=1,sleutels!$B$31,IF(data!L24=2,sleutels!$B$32,IF(data!L24=3,sleutels!$B$33))))","v":""},{"$f":"data!M24","v":""},{"$f":"data!AB24","v":0},{"$f":"data!AC24","v":0}]
[{"$f":"data!Q25","v":0},{"$f":"data!R25","v":0},{"$f":"data!S25","v":0},{"$f":"data!T25","v":0},{"$f":"data!U25","v":0},{"$f":"VLOOKUP(data!F25,sleutels!$A$18:$B$28,2,FALSE)","v":{"$error":"#N/A"}},{"$f":"VLOOKUP(data!G25,sleutels!$A$18:$B$28,2,FALSE)","v":{"$error":"#N/A"}},{"$f":"data!I25","v":""},{"$f":"data!J25","v":""},{"$f":"IF(data!L25=\"\",\"\",IF(data!L25=1,sleutels!$B$31,IF(data!L25=2,sleutels!$B$32,IF(data!L25=3,sleutels!$B$33))))","v":""},{"$f":"data!M25","v":""},{"$f":"data!AB25","v":0},{"$f":"data!AC25","v":0}]
[{"$f":"data!Q26","v":0},{"$f":"data!R26","v":0},{"$f":"data!S26","v":0},{"$f":"data!T26","v":0},{"$f":"data!U26","v":0},{"$f":"VLOOKUP(data!F26,sleutels!$A$18:$B$28,2,FALSE)","v":{"$error":"#N/A"}},{"$f":"VLOOKUP(data!G26,sleutels!$A$18:$B$28,2,FALSE)","v":{"$error":"#N/A"}},{"$f":"data!I26","v":""},{"$f":"data!J26","v":""},{"$f":"IF(data!L26=\"\",\"\",IF(data!L26=1,sleutels!$B$31,IF(data!L26=2,sleutels!$B$32,IF(data!L26=3,sleutels!$B$33))))","v":""},{"$f":"data!M26","v":""},{"$f":"data!AB26","v":0},{"$f":"data!AC26","v":0}]
[{"$f":"data!Q27","v":0},{"$f":"data!R27","v":0},{"$f":"data!S27","v":0},{"$f":"data!T27","v":0},{"$f":"data!U27","v":0},{"$f":"VLOOKUP(data!F27,sleutels!$A$18:$B$28,2,FALSE)","v":{"$error":"#N/A"}},{"$f":"VLOOKUP(data!G27,sleutels!$A$18:$B$28,2,FALSE)","v":{"$error":"#N/A"}},{"$f":"data!I27","v":""},{"$f":"data!J27","v":""},{"$f":"IF(data!L27=\"\",\"\",IF(data!L27=1,sleutels!$B$31,IF(data!L27=2,sleutels!$B$32,IF(data!L27=3,sleutels!$B$33))))","v":""},{"$f":"data!M27","v":""},{"$f":"data!AB27","v":0},{"$f":"data!AC27","v":0}]
[{"$f":"data!Q28","v":0},{"$f":"data!R28","v":0},{"$f":"data!S28","v":0},{"$f":"data!T28","v":0},{"$f":"data!U28","v":0},{"$f":"VLOOKUP(data!F28,sleutels!$A$18:$B$28,2,FALSE)","v":{"$error":"#N/A"}},{"$f":"VLOOKUP(data!G28,sleutels!$A$18:$B$28,2,FALSE)","v":{"$error":"#N/A"}},{"$f":"data!I28","v":""},{"$f":"data!J28","v":""},{"$f":"IF(data!L28=\"\",\"\",IF(data!L28=1,sleutels!$B$31,IF(data!L28=2,sleutels!$B$32,IF(data!L28=3,sleutels!$B$33))))","v":""},{"$f":"data!M28","v":""},{"$f":"data!AB28","v":0},{"$f":"data!AC28","v":0}]
[{"$f":"data!Q29","v":0},{"$f":"data!R29","v":0},{"$f":"data!S29","v":0},{"$f":"data!T29","v":0},{"$f":"data!U29","v":0},{"$f":"VLOOKUP(data!F29,sleutels!$A$18:$B$28,2,FALSE)","v":{"$error":"#N/A"}},{"$f":"VLOOKUP(data!G29,sleutels!$A$18:$B$28,2,FALSE)","v":{"$error":"#N/A"}},{"$f":"data!I29","v":""},{"$f":"data!J29","v":""},{"$f":"IF(data!L29=\"\",\"\",IF(data!L29=1,sleutels!$B$31,IF(data!L29=2,sleutels!$B$32,IF(data!L29=3,sleutels!$B$33))))","v":""},{"$f":"data!M29","v":""},{"$f":"data!AB29","v":0},{"$f":"data!AC29","v":0}]
[{"$f":"data!Q30","v":0},{"$f":"data!R30","v":0},{"$f":"data!S30","v":0},{"$f":"data!T30","v":0},{"$f":"data!U30","v":0},{"$f":"VLOOKUP(data!F30,sleutels!$A$18:$B$28,2,FALSE)","v":{"$error":"#N/A"}},{"$f":"VLOOKUP(data!G30,sleutels!$A$18:$B$28,2,FALSE)","v":{"$error":"#N/A"}},{"$f":"data!I30","v":""},{"$f":"data!J30","v":""},{"$f":"IF(data!L30=\"\",\"\",IF(data!L30=1,sleutels!$B$31,IF(data!L30=2,sleutels!$B$32,IF(data!L30=3,sleutels!$B$33))))","v":""},{"$f":"data!M30","v":""},{"$f":"data!AB30","v":0},{"$f":"data!AC30","v":0}]
[{"$f":"data!Q31","v":0},{"$f":"data!R31","v":0},{"$f":"data!S31","v":0},{"$f":"data!T31","v":0},{"$f":"data!U31","v":0},{"$f":"VLOOKUP(data!F31,sleutels!$A$18:$B$28,2,FALSE)","v":{"$error":"#N/A"}},{"$f":"VLOOKUP(data!G31,sleutels!$A$18:$B$28,2,FALSE)","v":{"$error":"#N/A"}},{"$f":"data!I31","v":""},{"$f":"data!J31","v":""},{"$f":"IF(data!L31=\"\",\"\",IF(data!L31=1,sleutels!$B$31,IF(data!L31=2,sleutels!$B$32,IF(data!L31=3,sleutels!$B$33))))","v":""},{"$f":"data!M31","v":""},{"$f":"data!AB31","v":0},{"$f":"data!AC31","v":0}]
[{"$f":"data!Q32","v":0},{"$f":"data!R32","v":0},{"$f":"data!S32","v":0},{"$f":"data!T32","v":0},{"$f":"data!U32","v":0},{"$f":"VLOOKUP(data!F32,sleutels!$A$18:$B$28,2,FALSE)","v":{"$error":"#N/A"}},{"$f":"VLOOKUP(data!G32,sleutels!$A$18:$B$28,2,FALSE)","v":{"$error":"#N/A"}},{"$f":"data!I32","v":""},{"$f":"data!J32","v":""},{"$f":"IF(data!L32=\"\",\"\",IF(data!L32=1,sleutels!$B$31,IF(data!L32=2,sleutels!$B$32,IF(data!L32=3,sleutels!$B$33))))","v":""},{"$f":"data!M32","v":""},{"$f":"data!AB32","v":0},{"$f":"data!AC32","v":0}]
[{"$f":"data!Q33","v":0},{"$f":"data!R33","v":0},{"$f":"data!S33","v":0},{"$f":"data!T33","v":0},{"$f":"data!U33","v":0},{"$f":"VLOOKUP(data!F33,sleutels!$A$18:$B$28,2,FALSE)","v":{"$error":"#N/A"}},{"$f":"VLOOKUP(data!G33,sleutels!$A$18:$B$28,2,FALSE)","v":{"$error":"#N/A"}},{"$f":"data!I33","v":""},{"$f":"data!J33","v":""},{"$f":"IF(data!L33=\"\",\"\",IF(data!L33=1,sleutels!$B$31,IF(data!L33=2,sleutels!$B$32,IF(data!L33=3,sleutels!$B$33))))","v":""},{"$f":"data!M33","v":""},{"$f":"data!AB33","v":0},{"$f":"data!AC33","v":0}]
[{"$f":"data!Q34","v":0},{"$f":"data!R34","v":0},{"$f":"data!S34","v":0},{"$f":"data!T34","v":0},{"$f":"data!U34","v":0},{"$f":"VLOOKUP(data!F34,sleutels!$A$18:$B$28,2,FALSE)","v":{"$error":"#N/A"}},{"$f":"VLOOKUP(data!G34,sleutels!$A$18:$B$28,2,FALSE)","v":{"$error":"#N/A"}},{"$f":"data!I34","v":""},{"$f":"data!J34","v":""},{"$f":"IF(data!L34=\"\",\"\",IF(data!L34=1,sleutels!$B$31,IF(data!L34=2,sleutels!$B$32,IF(data!L34=3,sleutels!$B$33))))","v":""},{"$f":"data!M34","v":""},{"$f":"data!AB34","v":0},{"$f":"data!AC34","v":0}]
[{"$f":"data!Q35","v":0},{"$f":"data!R35","v":0},{"$f":"data!S35","v":0},{"$f":"data!T35","v":0},{"$f":"data!U35","v":0},{"$f":"VLOOKUP(data!F35,sleutels!$A$18:$B$28,2,FALSE)","v":{"$error":"#N/A"}},{"$f":"VLOOKUP(data!G35,sleutels!$A$18:$B$28,2,FALSE)","v":{"$error":"#N/A"}},{"$f":"data!I35","v":""},{"$f":"data!J35","v":""},{"$f":"IF(data!L35=\"\",\"\",IF(data!L35=1,sleutels!$B$31,IF(data!L35=2,sleutels!$B$32,IF(data!L35=3,sleutels!$B$33))))","v":""},{"$f":"data!M35","v":""},{"$f":"data!AB35","v":0},{"$f":"data!AC35","v":0}]
[{"$f":"data!Q36","v":0},{"$f":"data!R36","v":0},{"$f":"data!S36","v":0},{"$f":"data!T36","v":0},{"$f":"data!U36","v":0},{"$f":"VLOOKUP(data!F36,sleutels!$A$18:$B$28,2,FALSE)","v":{"$error":"#N/A"}},{"$f":"VLOOKUP(data!G36,sleutels!$A$18:$B$28,2,FALSE)","v":{"$error":"#N/A"}},{"$f":"data!I36","v":""},{"$f":"data!J36","v":""},{"$f":"IF(data!L36=\"\",\"\",IF(data!L36=1,sleutels!$B$31,IF(data!L36=2,sleutels!$B$32,IF(data!L36=3,sleutels!$B$33))))","v":""},{"$f":"data!M36","v":""},{"$f":"data!AB36","v":0},{"$f":"data!AC36","v":0}]
[{"$f":"data!Q37","v":0},{"$f":"data!R37","v":0},{"$f":"data!S37","v":0},{"$f":"data!T37","v":0},{"$f":"data!U37","v":0},{"$f":"VLOOKUP(data!F37,sleutels!$A$18:$B$28,2,FALSE)","v":{"$error":"#N/A"}},{"$f":"VLOOKUP(data!G37,sleutels!$A$18:$B$28,2,FALSE)","v":{"$error":"#N/A"}},{"$f":"data!I37","v":""},{"$f":"data!J37","v":""},{"$f":"IF(data!L37=\"\",\"\",IF(data!L37=1,sleutels!$B$31,IF(data!L37=2,sleutels!$B$32,IF(data!L37=3,sleutels!$B$33))))","v":""},{"$f":"data!M37","v":""},{"$f":"data!AB37","v":0},{"$f":"data!AC37","v":0}]
[{"$f":"data!Q38","v":0},{"$f":"data!R38","v":0},{"$f":"data!S38","v":0},{"$f":"data!T38","v":0},{"$f":"data!U38","v":0},{"$f":"VLOOKUP(data!F38,sleutels!$A$18:$B$28,2,FALSE)","v":{"$error":"#N/A"}},{"$f":"VLOOKUP(data!G38,sleutels!$A$18:$B$28,2,FALSE)","v":{"$error":"#N/A"}},{"$f":"data!I38","v":""},{"$f":"data!J38","v":""},{"$f":"IF(data!L38=\"\",\"\",IF(data!L38=1,sleutels!$B$31,IF(data!L38=2,sleutels!$B$32,IF(data!L38=3,sleutels!$B$33))))","v":""},{"$f":"data!M38","v":""},{"$f":"data!AB38","v":0},{"$f":"data!AC38","v":0}]
[{"$f":"data!Q39","v":0},{"$f":"data!R39","v":0},{"$f":"data!S39","v":0},{"$f":"data!T39","v":0},{"$f":"data!U39","v":0},{"$f":"VLOOKUP(data!F39,sleutels!$A$18:$B$28,2,FALSE)","v":{"$error":"#N/A"}},{"$f":"VLOOKUP(data!G39,sleutels!$A$18:$B$28,2,FALSE)","v":{"$error":"#N/A"}},{"$f":"data!I39","v":""},{"$f":"data!J39","v":""},{"$f":"IF(data!L39=\"\",\"\",IF(data!L39=1,sleutels!$B$31,IF(data!L39=2,sleutels!$B$32,IF(data!L39=3,sleutels!$B$33))))","v":""},{"$f":"data!M39","v":""},{"$f":"data!AB39","v":0},{"$f":"data!AC39","v":0}]
[{"$f":"data!Q40","v":0},{"$f":"data!R40","v":0},{"$f":"data!S40","v":0},{"$f":"data!T40","v":0},{"$f":"data!U40","v":0},{"$f":"VLOOKUP(data!F40,sleutels!$A$18:$B$28,2,FALSE)","v":{"$error":"#N/A"}},{"$f":"VLOOKUP(data!G40,sleutels!$A$18:$B$28,2,FALSE)","v":{"$error":"#N/A"}},{"$f":"data!I40","v":""},{"$f":"data!J40","v":""},{"$f":"IF(data!L40=\"\",\"\",IF(data!L40=1,sleutels!$B$31,IF(data!L40=2,sleutels!$B$32,IF(data!L40=3,sleutels!$B$33))))","v":""},{"$f":"data!M40","v":""},{"$f":"data!AB40","v":0},{"$f":"data!AC40","v":0}]
[{"$f":"data!Q41","v":0},{"$f":"data!R41","v":0},{"$f":"data!S41","v":0},{"$f":"data!T41","v":0},{"$f":"data!U41","v":0},{"$f":"VLOOKUP(data!F41,sleutels!$A$18:$B$28,2,FALSE)","v":{"$error":"#N/A"}},{"$f":"VLOOKUP(data!G41,sleutels!$A$18:$B$28,2,FALSE)","v":{"$error":"#N/A"}},{"$f":"data!I41","v":""},{"$f":"data!J41","v":""},{"$f":"IF(data!L41=\"\",\"\",IF(data!L41=1,sleutels!$B$31,IF(data!L41=2,sleutels!$B$32,IF(data!L41=3,sleutels!$B$33))))","v":""},{"$f":"data!M41","v":""},{"$f":"data!AB41","v":0},{"$f":"data!AC41","v":0}]
[{"$f":"data!Q42","v":0},{"$f":"data!R42","v":0},{"$f":"data!S42","v":0},{"$f":"data!T42","v":0},{"$f":"data!U42","v":0},{"$f":"VLOOKUP(data!F42,sleutels!$A$18:$B$28,2,FALSE)","v":{"$error":"#N/A"}},{"$f":"VLOOKUP(data!G42,sleutels!$A$18:$B$28,2,FALSE)","v":{"$error":"#N/A"}},{"$f":"data!I42","v":""},{"$f":"data!J42","v":""},{"$f":"IF(data!L42=\"\",\"\",IF(data!L42=1,sleutels!$B$31,IF(data!L42=2,sleutels!$B$32,IF(data!L42=3,sleutels!$B$33))))","v":""},{"$f":"data!M42","v":""},{"$f":"data!AB42","v":0},{"$f":"data!AC42","v":0}]
[{"$f":"data!Q43","v":0},{"$f":"data!R43","v":0},{"$f":"data!S43","v":0},{"$f":"data!T43","v":0},{"$f":"data!U43","v":0},{"$f":"VLOOKUP(data!F43,sleutels!$A$18:$B$28,2,FALSE)","v":{"$error":"#N/A"}},{"$f":"VLOOKUP(data!G43,sleutels!$A$18:$B$28,2,FALSE)","v":{"$error":"#N/A"}},{"$f":"data!I43","v":""},{"$f":"data!J43","v":""},{"$f":"IF(data!L43=\"\",\"\",IF(data!L43=1,sleutels!$B$31,IF(data!L43=2,sleutels!$B$32,IF(data!L43=3,sleutels!$B$33))))","v":""},{"$f":"data!M43","v":""},{"$f":"data!AB43","v":0},{"$f":"data!AC43","v":0}]
[{"$f":"data!Q44","v":0},{"$f":"data!R44","v":0},{"$f":"data!S44","v":0},{"$f":"data!T44","v":0},{"$f":"data!U44","v":0},{"$f":"VLOOKUP(data!F44,sleutels!$A$18:$B$28,2,FALSE)","v":{"$error":"#N/A"}},{"$f":"VLOOKUP(data!G44,sleutels!$A$18:$B$28,2,FALSE)","v":{"$error":"#N/A"}},{"$f":"data!I44","v":""},{"$f":"data!J44","v":""},{"$f":"IF(data!L44=\"\",\"\",IF(data!L44=1,sleutels!$B$31,IF(data!L44=2,sleutels!$B$32,IF(data!L44=3,sleutels!$B$33))))","v":""},{"$f":"data!M44","v":""},{"$f":"data!AB44","v":0},{"$f":"data!AC44","v":0}]
[{"$f":"data!Q45","v":0},{"$f":"data!R45","v":0},{"$f":"data!S45","v":0},{"$f":"data!T45","v":0},{"$f":"data!U45","v":0},{"$f":"VLOOKUP(data!F45,sleutels!$A$18:$B$28,2,FALSE)","v":{"$error":"#N/A"}},{"$f":"VLOOKUP(data!G45,sleutels!$A$18:$B$28,2,FALSE)","v":{"$error":"#N/A"}},{"$f":"data!I45","v":""},{"$f":"data!J45","v":""},{"$f":"IF(data!L45=\"\",\"\",IF(data!L45=1,sleutels!$B$31,IF(data!L45=2,sleutels!$B$32,IF(data!L45=3,sleutels!$B$33))))","v":""},{"$f":"data!M45","v":""},{"$f":"data!AB45","v":0},{"$f":"data!AC45","v":0}]
[{"$f":"data!Q46","v":0},{"$f":"data!R46","v":0},{"$f":"data!S46","v":0},{"$f":"data!T46","v":0},{"$f":"data!U46","v":0},{"$f":"VLOOKUP(data!F46,sleutels!$A$18:$B$28,2,FALSE)","v":{"$error":"#N/A"}},{"$f":"VLOOKUP(data!G46,sleutels!$A$18:$B$28,2,FALSE)","v":{"$error":"#N/A"}},{"$f":"data!I46","v":""},{"$f":"data!J46","v":""},{"$f":"IF(data!L46=\"\",\"\",IF(data!L46=1,sleutels!$B$31,IF(data!L46=2,sleutels!$B$32,IF(data!L46=3,sleutels!$B$33))))","v":""},{"$f":"data!M46","v":""},{"$f":"data!AB46","v":0},{"$f":"data!AC46","v":0}]
[{"$f":"data!Q47","v":0},{"$f":"data!R47","v":0},{"$f":"data!S47","v":0},{"$f":"data!T47","v":0},{"$f":"data!U47","v":0},{"$f":"VLOOKUP(data!F47,sleutels!$A$18:$B$28,2,FALSE)","v":{"$error":"#N/A"}},{"$f":"VLOOKUP(data!G47,sleutels!$A$18:$B$28,2,FALSE)","v":{"$error":"#N/A"}},{"$f":"data!I47","v":""},{"$f":"data!J47","v":""},{"$f":"IF(data!L47=\"\",\"\",IF(data!L47=1,sleutels!$B$31,IF(data!L47=2,sleutels!$B$32,IF(data!L47=3,sleutels!$B$33))))","v":""},{"$f":"data!M47","v":""},{"$f":"data!AB47","v":0},{"$f":"data!AC47","v":0}]
[{"$f":"data!Q48","v":0},{"$f":"data!R48","v":0},{"$f":"data!S48","v":0},{"$f":"data!T48","v":0},{"$f":"data!U48","v":0},{"$f":"VLOOKUP(data!F48,sleutels!$A$18:$B$28,2,FALSE)","v":{"$error":"#N/A"}},{"$f":"VLOOKUP(data!G48,sleutels!$A$18:$B$28,2,FALSE)","v":{"$error":"#N/A"}},{"$f":"data!I48","v":""},{"$f":"data!J48","v":""},{"$f":"IF(data!L48=\"\",\"\",IF(data!L48=1,sleutels!$B$31,IF(data!L48=2,sleutels!$B$32,IF(data!L48=3,sleutels!$B$33))))","v":""},{"$f":"data!M48","v":""},{"$f":"data!AB48","v":0},{"$f":"data!AC48","v":0}]
[{"$f":"data!Q49","v":0},{"$f":"data!R49","v":0},{"$f":"data!S49","v":0},{"$f":"data!T49","v":0},{"$f":"data!U49","v":0},{"$f":"VLOOKUP(data!F49,sleutels!$A$18:$B$28,2,FALSE)","v":{"$error":"#N/A"}},{"$f":"VLOOKUP(data!G49,sleutels!$A$18:$B$28,2,FALSE)","v":{"$error":"#N/A"}},{"$f":"data!I49","v":""},{"$f":"data!J49","v":""},{"$f":"IF(data!L49=\"\",\"\",IF(data!L49=1,sleutels!$B$31,IF(data!L49=2,sleutels!$B$32,IF(data!L49=3,sleutels!$B$33))))","v":""},{"$f":"data!M49","v":""},{"$f":"data!AB49","v":0},{"$f":"data!AC49","v":0}]
[{"$f":"data!Q50","v":0},{"$f":"data!R50","v":0},{"$f":"data!S50","v":0},{"$f":"data!T50","v":0},{"$f":"data!U50","v":0},{"$f":"VLOOKUP(data!F50,sleutels!$A$18:$B$28,2,FALSE)","v":{"$error":"#N/A"}},{"$f":"VLOOKUP(data!G50,sleutels!$A$18:$B$28,2,FALSE)","v":{"$error":"#N/A"}},{"$f":"data!I50","v":""},{"$f":"data!J50","v":""},{"$f":"IF(data!L50=\"\",\"\",IF(data!L50=1,sleutels!$B$31,IF(data!L50=2,sleutels!$B$32,IF(data!L50=3,sleutels!$B$33))))","v":""},{"$f":"data!M50","v":""},{"$f":"data!AB50","v":0},{"$f":"data!AC50","v":0}]
[{"$f":"data!Q51","v":0},{"$f":"data!R51","v":0},{"$f":"data!S51","v":0},{"$f":"data!T51","v":0},{"$f":"data!U51","v":0},{"$f":"VLOOKUP(data!F51,sleutels!$A$18:$B$28,2,FALSE)","v":{"$error":"#N/A"}},{"$f":"VLOOKUP(data!G51,sleutels!$A$18:$B$28,2,FALSE)","v":{"$error":"#N/A"}},{"$f":"data!I51","v":""},{"$f":"data!J51","v":""},{"$f":"IF(data!L51=\"\",\"\",IF(data!L51=1,sleutels!$B$31,IF(data!L51=2,sleutels!$B$32,IF(data!L51=3,sleutels!$B$33))))","v":""},{"$f":"data!M51","v":""},{"$f":"data!AB51","v":0},{"$f":"data!AC51","v":0}]
[{"$f":"data!Q52","v":0},{"$f":"data!R52","v":0},{"$f":"data!S52","v":0},{"$f":"data!T52","v":0},{"$f":"data!U52","v":0},{"$f":"VLOOKUP(data!F52,sleutels!$A$18:$B$28,2,FALSE)","v":{"$error":"#N/A"}},{"$f":"VLOOKUP(data!G52,sleutels!$A$18:$B$28,2,FALSE)","v":{"$error":"#N/A"}},{"$f":"data!I52","v":""},{"$f":"data!J52","v":""},{"$f":"IF(data!L52=\"\",\"\",IF(data!L52=1,sleutels!$B$31,IF(data!L52=2,sleutels!$B$32,IF(data!L52=3,sleutels!$B$33))))","v":""},{"$f":"data!M52","v":""},{"$f":"data!AB52","v":0},{"$f":"data!AC52","v":0}]
[{"$f":"data!Q53","v":0},{"$f":"data!R53","v":0},{"$f":"data!S53","v":0},{"$f":"data!T53","v":0},{"$f":"data!U53","v":0},{"$f":"VLOOKUP(data!F53,sleutels!$A$18:$B$28,2,FALSE)","v":{"$error":"#N/A"}},{"$f":"VLOOKUP(data!G53,sleutels!$A$18:$B$28,2,FALSE)","v":{"$error":"#N/A"}},{"$f":"data!I53","v":""},{"$f":"data!J53","v":""},{"$f":"IF(data!L53=\"\",\"\",IF(data!L53=1,sleutels!$B$31,IF(data!L53=2,sleutels!$B$32,IF(data!L53=3,sleutels!$B$33))))","v":""},{"$f":"data!M53","v":""},{"$f":"data!AB53","v":0},{"$f":"data!AC53","v":0}]
[{"$f":"data!Q54","v":0},{"$f":"data!R54","v":0},{"$f":"data!S54","v":0},{"$f":"data!T54","v":0},{"$f":"data!U54","v":0},{"$f":"VLOOKUP(data!F54,sleutels!$A$18:$B$28,2,FALSE)","v":{"$error":"#N/A"}},{"$f":"VLOOKUP(data!G54,sleutels!$A$18:$B$28,2,FALSE)","v":{"$error":"#N/A"}},{"$f":"data!I54","v":""},{"$f":"data!J54","v":""},{"$f":"IF(data!L54=\"\",\"\",IF(data!L54=1,sleutels!$B$31,IF(data!L54=2,sleutels!$B$32,IF(data!L54=3,sleutels!$B$33))))","v":""},{"$f":"data!M54","v":""},{"$f":"data!AB54","v":0},{"$f":"data!AC54","v":0}]
[{"$f":"data!Q55","v":0},{"$f":"data!R55","v":0},{"$f":"data!S55","v":0},{"$f":"data!T55","v":0},{"$f":"data!U55","v":0},{"$f":"VLOOKUP(data!F55,sleutels!$A$18:$B$28,2,FALSE)","v":{"$error":"#N/A"}},{"$f":"VLOOKUP(data!G55,sleutels!$A$18:$B$28,2,FALSE)","v":{"$error":"#N/A"}},{"$f":"data!I55","v":""},{"$f":"data!J55","v":""},{"$f":"IF(data!L55=\"\",\"\",IF(data!L55=1,sleutels!$B$31,IF(data!L55=2,sleutels!$B$32,IF(data!L55=3,sleutels!$B$33))))","v":""},{"$f":"data!M55","v":""},{"$f":"data!AB55","v":0},{"$f":"data!AC55","v":0}]
[{"$f":"data!Q56","v":0},{"$f":"data!R56","v":0},{"$f":"data!S56","v":0},{"$f":"data!T56","v":0},{"$f":"data!U56","v":0},{"$f":"VLOOKUP(data!F56,sleutels!$A$18:$B$28,2,FALSE)","v":{"$error":"#N/A"}},{"$f":"VLOOKUP(data!G56,sleutels!$A$18:$B$28,2,FALSE)","v":{"$error":"#N/A"}},{"$f":"data!I56","v":""},{"$f":"data!J56","v":""},{"$f":"IF(data!L56=\"\",\"\",IF(data!L56=1,sleutels!$B$31,IF(data!L56=2,sleutels!$B$32,IF(data!L56=3,sleutels!$B$33))))","v":""},{"$f":"data!M56","v":""},{"$f":"data!AB56","v":0},{"$f":"data!AC56","v":0}]
[{"$f":"data!Q57","v":0},{"$f":"data!R57","v":0},{"$f":"data!S57","v":0},{"$f":"data!T57","v":0},{"$f":"data!U57","v":0},{"$f":"VLOOKUP(data!F57,sleutels!$A$18:$B$28,2,FALSE)","v":{"$error":"#N/A"}},{"$f":"VLOOKUP(data!G57,sleutels!$A$18:$B$28,2,FALSE)","v":{"$error":"#N/A"}},{"$f":"data!I57","v":""},{"$f":"data!J57","v":""},{"$f":"IF(data!L57=\"\",\"\",IF(data!L57=1,sleutels!$B$31,IF(data!L57=2,sleutels!$B$32,IF(data!L57=3,sleutels!$B$33))))","v":""},{"$f":"data!M57","v":""},{"$f":"data!AB57","v":0},{"$f":"data!AC57","v":0}]
[{"$f":"data!Q58","v":0},{"$f":"data!R58","v":0},{"$f":"data!S58","v":0},{"$f":"data!T58","v":0},{"$f":"data!U58","v":0},{"$f":"VLOOKUP(data!F58,sleutels!$A$18:$B$28,2,FALSE)","v":{"$error":"#N/A"}},{"$f":"VLOOKUP(data!G58,sleutels!$A$18:$B$28,2,FALSE)","v":{"$error":"#N/A"}},{"$f":"data!I58","v":""},{"$f":"data!J58","v":""},{"$f":"IF(data!L58=\"\",\"\",IF(data!L58=1,sleutels!$B$31,IF(data!L58=2,sleutels!$B$32,IF(data!L58=3,sleutels!$B$33))))","v":""},{"$f":"data!M58","v":""},{"$f":"data!AB58","v":0},{"$f":"data!AC58","v":0}]
[{"$f":"data!Q59","v":0},{"$f":"data!R59","v":0},{"$f":"data!S59","v":0},{"$f":"data!T59","v":0},{"$f":"data!U59","v":0},{"$f":"VLOOKUP(data!F59,sleutels!$A$18:$B$28,2,FALSE)","v":{"$error":"#N/A"}},{"$f":"VLOOKUP(data!G59,sleutels!$A$18:$B$28,2,FALSE)","v":{"$error":"#N/A"}},{"$f":"data!I59","v":""},{"$f":"data!J59","v":""},{"$f":"IF(data!L59=\"\",\"\",IF(data!L59=1,sleutels!$B$31,IF(data!L59=2,sleutels!$B$32,IF(data!L59=3,sleutels!$B$33))))","v":""},{"$f":"data!M59","v":""},{"$f":"data!AB59","v":0},{"$f":"data!AC59","v":0}]
[{"$f":"data!Q60","v":0},{"$f":"data!R60","v":0},{"$f":"data!S60","v":0},{"$f":"data!T60","v":0},{"$f":"data!U60","v":0},{"$f":"VLOOKUP(data!F60,sleutels!$A$18:$B$28,2,FALSE)","v":{"$error":"#N/A"}},{"$f":"VLOOKUP(data!G60,sleutels!$A$18:$B$28,2,FALSE)","v":{"$error":"#N/A"}},{"$f":"data!I60","v":""},{"$f":"data!J60","v":""},{"$f":"IF(data!L60=\"\",\"\",IF(data!L60=1,sleutels!$B$31,IF(data!L60=2,sleutels!$B$32,IF(data!L60=3,sleutels!$B$33))))","v":""},{"$f":"data!M60","v":""},{"$f":"data!AB60","v":0},{"$f":"data!AC60","v":0}]
[{"$f":"data!Q61","v":0},{"$f":"data!R61","v":0},{"$f":"data!S61","v":0},{"$f":"data!T61","v":0},{"$f":"data!U61","v":0},{"$f":"VLOOKUP(data!F61,sleutels!$A$18:$B$28,2,FALSE)","v":{"$error":"#N/A"}},{"$f":"VLOOKUP(data!G61,sleutels!$A$18:$B$28,2,FALSE)","v":{"$error":"#N/A"}},{"$f":"data!I61","v":""},{"$f":"data!J61","v":""},{"$f":"IF(data!L61=\"\",\"\",IF(data!L61=1,sleutels!$B$31,IF(data!L61=2,sleutels!$B$32,IF(data!L61=3,sleutels!$B$33))))","v":""},{"$f":"data!M61","v":""},{"$f":"data!AB61","v":0},{"$f":"data!AC61","v":0}]
[{"$f":"data!Q62","v":0},{"$f":"data!R62","v":0},{"$f":"data!S62","v":0},{"$f":"data!T62","v":0},{"$f":"data!U62","v":0},{"$f":"VLOOKUP(data!F62,sleutels!$A$18:$B$28,2,FALSE)","v":{"$error":"#N/A"}},{"$f":"VLOOKUP(data!G62,sleutels!$A$18:$B$28,2,FALSE)","v":{"$error":"#N/A"}},{"$f":"data!I62","v":""},{"$f":"data!J62","v":""},{"$f":"IF(data!L62=\"\",\"\",IF(data!L62=1,sleutels!$B$31,IF(data!L62=2,sleutels!$B$32,IF(data!L62=3,sleutels!$B$33))))","v":""},{"$f":"data!M62","v":""},{"$f":"data!AB62","v":0},{"$f":"data!AC62","v":0}]
[{"$f":"data!Q63","v":0},{"$f":"data!R63","v":0},{"$f":"data!S63","v":0},{"$f":"data!T63","v":0},{"$f":"data!U63","v":0},{"$f":"VLOOKUP(data!F63,sleutels!$A$18:$B$28,2,FALSE)","v":{"$error":"#N/A"}},{"$f":"VLOOKUP(data!G63,sleutels!$A$18:$B$28,2,FALSE)","v":{"$error":"#N/A"}},{"$f":"data!I63","v":""},{"$f":"data!J63","v":""},{"$f":"IF(data!L63=\"\",\"\",IF(data!L63=1,sleutels!$B$31,IF(data!L63=2,sleutels!$B$32,IF(data!L63=3,sleutels!$B$33))))","v":""},{"$f":"data!M63","v":""},{"$f":"data!AB63","v":0},{"$f":"data!AC63","v":0}]
[{"$f":"data!Q64","v":0},{"$f":"data!R64","v":0},{"$f":"data!S64","v":0},{"$f":"data!T64","v":0},{"$f":"data!U64","v":0},{"$f":"VLOOKUP(data!F64,sleutels!$A$18:$B$28,2,FALSE)","v":{"$error":"#N/A"}},{"$f":"VLOOKUP(data!G64,sleutels!$A$18:$B$28,2,FALSE)","v":{"$error":"#N/A"}},{"$f":"data!I64","v":""},{"$f":"data!J64","v":""},{"$f":"IF(data!L64=\"\",\"\",IF(data!L64=1,sleutels!$B$31,IF(data!L64=2,sleutels!$B$32,IF(data!L64=3,sleutels!$B$33))))","v":""},{"$f":"data!M64","v":""},{"$f":"data!AB64","v":0},{"$f":"data!AC64","v":0}]
[{"$f":"data!Q65","v":0},{"$f":"data!R65","v":0},{"$f":"data!S65","v":0},{"$f":"data!T65","v":0},{"$f":"data!U65","v":0},{"$f":"VLOOKUP(data!F65,sleutels!$A$18:$B$28,2,FALSE)","v":{"$error":"#N/A"}},{"$f":"VLOOKUP(data!G65,sleutels!$A$18:$B$28,2,FALSE)","v":{"$error":"#N/A"}},{"$f":"data!I65","v":""},{"$f":"data!J65","v":""},{"$f":"IF(data!L65=\"\",\"\",IF(data!L65=1,sleutels!$B$31,IF(data!L65=2,sleutels!$B$32,IF(data!L65=3,sleutels!$B$33))))","v":""},{"$f":"data!M65","v":""},{"$f":"data!AB65","v":0},{"$f":"data!AC65","v":0}]
[{"$f":"data!Q66","v":0},{"$f":"data!R66","v":0},{"$f":"data!S66","v":0},{"$f":"data!T66","v":0},{"$f":"data!U66","v":0},{"$f":"VLOOKUP(data!F66,sleutels!$A$18:$B$28,2,FALSE)","v":{"$error":"#N/A"}},{"$f":"VLOOKUP(data!G66,sleutels!$A$18:$B$28,2,FALSE)","v":{"$error":"#N/A"}},{"$f":"data!I66","v":""},{"$f":"data!J66","v":""},{"$f":"IF(data!L66=\"\",\"\",IF(data!L66=1,sleutels!$B$31,IF(data!L66=2,sleutels!$B$32,IF(data!L66=3,sleutels!$B$33))))","v":""},{"$f":"data!M66","v":""},{"$f":"data!AB66","v":0},{"$f":"data!AC66","v":0}]
[{"$f":"data!Q67","v":0},{"$f":"data!R67","v":0},{"$f":"data!S67","v":0},{"$f":"data!T67","v":0},{"$f":"data!U67","v":0},{"$f":"VLOOKUP(data!F67,sleutels!$A$18:$B$28,2,FALSE)","v":{"$error":"#N/A"}},{"$f":"VLOOKUP(data!G67,sleutels!$A$18:$B$28,2,FALSE)","v":{"$error":"#N/A"}},{"$f":"data!I67","v":""},{"$f":"data!J67","v":""},{"$f":"IF(data!L67=\"\",\"\",IF(data!L67=1,sleutels!$B$31,IF(data!L67=2,sleutels!$B$32,IF(data!L67=3,sleutels!$B$33))))","v":""},{"$f":"data!M67","v":""},{"$f":"data!AB67","v":0},{"$f":"data!AC67","v":0}]
[{"$f":"data!Q68","v":0},{"$f":"data!R68","v":0},{"$f":"data!S68","v":0},{"$f":"data!T68","v":0},{"$f":"data!U68","v":0},{"$f":"VLOOKUP(data!F68,sleutels!$A$18:$B$28,2,FALSE)","v":{"$error":"#N/A"}},{"$f":"VLOOKUP(data!G68,sleutels!$A$18:$B$28,2,FALSE)","v":{"$error":"#N/A"}},{"$f":"data!I68","v":""},{"$f":"data!J68","v":""},{"$f":"IF(data!L68=\"\",\"\",IF(data!L68=1,sleutels!$B$31,IF(data!L68=2,sleutels!$B$32,IF(data!L68=3,sleutels!$B$33))))","v":""},{"$f":"data!M68","v":""},{"$f":"data!AB68","v":0},{"$f":"data!AC68","v":0}]
[{"$f":"data!Q69","v":0},{"$f":"data!R69","v":0},{"$f":"data!S69","v":0},{"$f":"data!T69","v":0},{"$f":"data!U69","v":0},{"$f":"VLOOKUP(data!F69,sleutels!$A$18:$B$28,2,FALSE)","v":{"$error":"#N/A"}},{"$f":"VLOOKUP(data!G69,sleutels!$A$18:$B$28,2,FALSE)","v":{"$error":"#N/A"}},{"$f":"data!I69","v":""},{"$f":"data!J69","v":""},{"$f":"IF(data!L69=\"\",\"\",IF(data!L69=1,sleutels!$B$31,IF(data!L69=2,sleutels!$B$32,IF(data!L69=3,sleutels!$B$33))))","v":""},{"$f":"data!M69","v":""},{"$f":"data!AB69","v":0},{"$f":"data!AC69","v":0}]
[{"$f":"data!Q70","v":0},{"$f":"data!R70","v":0},{"$f":"data!S70","v":0},{"$f":"data!T70","v":0},{"$f":"data!U70","v":0},{"$f":"VLOOKUP(data!F70,sleutels!$A$18:$B$28,2,FALSE)","v":{"$error":"#N/A"}},{"$f":"VLOOKUP(data!G70,sleutels!$A$18:$B$28,2,FALSE)","v":{"$error":"#N/A"}},{"$f":"data!I70","v":""},{"$f":"data!J70","v":""},{"$f":"IF(data!L70=\"\",\"\",IF(data!L70=1,sleutels!$B$31,IF(data!L70=2,sleutels!$B$32,IF(data!L70=3,sleutels!$B$33))))","v":""},{"$f":"data!M70","v":""},{"$f":"data!AB70","v":0},{"$f":"data!AC70","v":0}]
[{"$f":"data!Q71","v":0},{"$f":"data!R71","v":0},{"$f":"data!S71","v":0},{"$f":"data!T71","v":0},{"$f":"data!U71","v":0},{"$f":"VLOOKUP(data!F71,sleutels!$A$18:$B$28,2,FALSE)","v":{"$error":"#N/A"}},{"$f":"VLOOKUP(data!G71,sleutels!$A$18:$B$28,2,FALSE)","v":{"$error":"#N/A"}},{"$f":"data!I71","v":""},{"$f":"data!J71","v":""},{"$f":"IF(data!L71=\"\",\"\",IF(data!L71=1,sleutels!$B$31,IF(data!L71=2,sleutels!$B$32,IF(data!L71=3,sleutels!$B$33))))","v":""},{"$f":"data!M71","v":""},{"$f":"data!AB71","v":0},{"$f":"data!AC71","v":0}]
[{"$f":"data!Q72","v":0},{"$f":"data!R72","v":0},{"$f":"data!S72","v":0},{"$f":"data!T72","v":0},{"$f":"data!U72","v":0},{"$f":"VLOOKUP(data!F72,sleutels!$A$18:$B$28,2,FALSE)","v":{"$error":"#N/A"}},{"$f":"VLOOKUP(data!G72,sleutels!$A$18:$B$28,2,FALSE)","v":{"$error":"#N/A"}},{"$f":"data!I72","v":""},{"$f":"data!J72","v":""},{"$f":"IF(data!L72=\"\",\"\",IF(data!L72=1,sleutels!$B$31,IF(data!L72=2,sleutels!$B$32,IF(data!L72=3,sleutels!$B$33))))","v":""},{"$f":"data!M72","v":""},{"$f":"data!AB72","v":0},{"$f":"data!AC72","v":0}]
[{"$f":"data!Q73","v":0},{"$f":"data!R73","v":0},{"$f":"data!S73","v":0},{"$f":"data!T73","v":0},{"$f":"data!U73","v":0},{"$f":"VLOOKUP(data!F73,sleutels!$A$18:$B$28,2,FALSE)","v":{"$error":"#N/A"}},{"$f":"VLOOKUP(data!G73,sleutels!$A$18:$B$28,2,FALSE)","v":{"$error":"#N/A"}},{"$f":"data!I73","v":""},{"$f":"data!J73","v":""},{"$f":"IF(data!L73=\"\",\"\",IF(data!L73=1,sleutels!$B$31,IF(data!L73=2,sleutels!$B$32,IF(data!L73=3,sleutels!$B$33))))","v":""},{"$f":"data!M73","v":""},{"$f":"data!AB73","v":0},{"$f":"data!AC73","v":0}]
[{"$f":"data!Q74","v":0},{"$f":"data!R74","v":0},{"$f":"data!S74","v":0},{"$f":"data!T74","v":0},{"$f":"data!U74","v":0},{"$f":"VLOOKUP(data!F74,sleutels!$A$18:$B$28,2,FALSE)","v":{"$error":"#N/A"}},{"$f":"VLOOKUP(data!G74,sleutels!$A$18:$B$28,2,FALSE)","v":{"$error":"#N/A"}},{"$f":"data!I74","v":""},{"$f":"data!J74","v":""},{"$f":"IF(data!L74=\"\",\"\",IF(data!L74=1,sleutels!$B$31,IF(data!L74=2,sleutels!$B$32,IF(data!L74=3,sleutels!$B$33))))","v":""},{"$f":"data!M74","v":""},{"$f":"data!AB74","v":0},{"$f":"data!AC74","v":0}]
[{"$f":"data!Q75","v":0},{"$f":"data!R75","v":0},{"$f":"data!S75","v":0},{"$f":"data!T75","v":0},{"$f":"data!U75","v":0},{"$f":"VLOOKUP(data!F75,sleutels!$A$18:$B$28,2,FALSE)","v":{"$error":"#N/A"}},{"$f":"VLOOKUP(data!G75,sleutels!$A$18:$B$28,2,FALSE)","v":{"$error":"#N/A"}},{"$f":"data!I75","v":""},{"$f":"data!J75","v":""},{"$f":"IF(data!L75=\"\",\"\",IF(data!L75=1,sleutels!$B$31,IF(data!L75=2,sleutels!$B$32,IF(data!L75=3,sleutels!$B$33))))","v":""},{"$f":"data!M75","v":""},{"$f":"data!AB75","v":0},{"$f":"data!AC75","v":0}]
[{"$f":"data!Q76","v":0},{"$f":"data!R76","v":0},{"$f":"data!S76","v":0},{"$f":"data!T76","v":0},{"$f":"data!U76","v":0},{"$f":"VLOOKUP(data!F76,sleutels!$A$18:$B$28,2,FALSE)","v":{"$error":"#N/A"}},{"$f":"VLOOKUP(data!G76,sleutels!$A$18:$B$28,2,FALSE)","v":{"$error":"#N/A"}},{"$f":"data!I76","v":""},{"$f":"data!J76","v":""},{"$f":"IF(data!L76=\"\",\"\",IF(data!L76=1,sleutels!$B$31,IF(data!L76=2,sleutels!$B$32,IF(data!L76=3,sleutels!$B$33))))","v":""},{"$f":"data!M76","v":""},{"$f":"data!AB76","v":0},{"$f":"data!AC76","v":0}]
[{"$f":"data!Q77","v":0},{"$f":"data!R77","v":0},{"$f":"data!S77","v":0},{"$f":"data!T77","v":0},{"$f":"data!U77","v":0},{"$f":"VLOOKUP(data!F77,sleutels!$A$18:$B$28,2,FALSE)","v":{"$error":"#N/A"}},{"$f":"VLOOKUP(data!G77,sleutels!$A$18:$B$28,2,FALSE)","v":{"$error":"#N/A"}},{"$f":"data!I77","v":""},{"$f":"data!J77","v":""},{"$f":"IF(data!L77=\"\",\"\",IF(data!L77=1,sleutels!$B$31,IF(data!L77=2,sleutels!$B$32,IF(data!L77=3,sleutels!$B$33))))","v":""},{"$f":"data!M77","v":""},{"$f":"data!AB77","v":0},{"$f":"data!AC77","v":0}]
[{"$f":"data!Q78","v":0},{"$f":"data!R78","v":0},{"$f":"data!S78","v":0},{"$f":"data!T78","v":0},{"$f":"data!U78","v":0},{"$f":"VLOOKUP(data!F78,sleutels!$A$18:$B$28,2,FALSE)","v":{"$error":"#N/A"}},{"$f":"VLOOKUP(data!G78,sleutels!$A$18:$B$28,2,FALSE)","v":{"$error":"#N/A"}},{"$f":"data!I78","v":""},{"$f":"data!J78","v":""},{"$f":"IF(data!L78=\"\",\"\",IF(data!L78=1,sleutels!$B$31,IF(data!L78=2,sleutels!$B$32,IF(data!L78=3,sleutels!$B$33))))","v":""},{"$f":"data!M78","v":""},{"$f":"data!AB78","v":0},{"$f":"data!AC78","v":0}]
[{"$f":"data!Q79","v":0},{"$f":"data!R79","v":0},{"$f":"data!S79","v":0},{"$f":"data!T79","v":0},{"$f":"data!U79","v":0},{"$f":"VLOOKUP(data!F79,sleutels!$A$18:$B$28,2,FALSE)","v":{"$error":"#N/A"}},{"$f":"VLOOKUP(data!G79,sleutels!$A$18:$B$28,2,FALSE)","v":{"$error":"#N/A"}},{"$f":"data!I79","v":""},{"$f":"data!J79","v":""},{"$f":"IF(data!L79=\"\",\"\",IF(data!L79=1,sleutels!$B$31,IF(data!L79=2,sleutels!$B$32,IF(data!L79=3,sleutels!$B$33))))","v":""},{"$f":"data!M79","v":""},{"$f":"data!AB79","v":0},{"$f":"data!AC79","v":0}]
[{"$f":"data!Q80","v":0},{"$f":"data!R80","v":0},{"$f":"data!S80","v":0},{"$f":"data!T80","v":0},{"$f":"data!U80","v":0},{"$f":"VLOOKUP(data!F80,sleutels!$A$18:$B$28,2,FALSE)","v":{"$error":"#N/A"}},{"$f":"VLOOKUP(data!G80,sleutels!$A$18:$B$28,2,FALSE)","v":{"$error":"#N/A"}},{"$f":"data!I80","v":""},{"$f":"data!J80","v":""},{"$f":"IF(data!L80=\"\",\"\",IF(data!L80=1,sleutels!$B$31,IF(data!L80=2,sleutels!$B$32,IF(data!L80=3,sleutels!$B$33))))","v":""},{"$f":"data!M80","v":""},{"$f":"data!AB80","v":0},{"$f":"data!AC80","v":0}]
[{"$f":"data!Q81","v":0},{"$f":"data!R81","v":0},{"$f":"data!S81","v":0},{"$f":"data!T81","v":0},{"$f":"data!U81","v":0},{"$f":"VLOOKUP(data!F81,sleutels!$A$18:$B$28,2,FALSE)","v":{"$error":"#N/A"}},{"$f":"VLOOKUP(data!G81,sleutels!$A$18:$B$28,2,FALSE)","v":{"$error":"#N/A"}},{"$f":"data!I81","v":""},{"$f":"data!J81","v":""},{"$f":"IF(data!L81=\"\",\"\",IF(data!L81=1,sleutels!$B$31,IF(data!L81=2,sleutels!$B$32,IF(data!L81=3,sleutels!$B$33))))","v":""},{"$f":"data!M81","v":""},{"$f":"data!AB81","v":0},{"$f":"data!AC81","v":0}]
[{"$f":"data!Q82","v":0},{"$f":"data!R82","v":0},{"$f":"data!S82","v":0},{"$f":"data!T82","v":0},{"$f":"data!U82","v":0},{"$f":"VLOOKUP(data!F82,sleutels!$A$18:$B$28,2,FALSE)","v":{"$error":"#N/A"}},{"$f":"VLOOKUP(data!G82,sleutels!$A$18:$B$28,2,FALSE)","v":{"$error":"#N/A"}},{"$f":"data!I82","v":""},{"$f":"data!J82","v":""},{"$f":"IF(data!L82=\"\",\"\",IF(data!L82=1,sleutels!$B$31,IF(data!L82=2,sleutels!$B$32,IF(data!L82=3,sleutels!$B$33))))","v":""},{"$f":"data!M82","v":""},{"$f":"data!AB82","v":0},{"$f":"data!AC82","v":0}]
[{"$f":"data!Q83","v":0},{"$f":"data!R83","v":0},{"$f":"data!S83","v":0},{"$f":"data!T83","v":0},{"$f":"data!U83","v":0},{"$f":"VLOOKUP(data!F83,sleutels!$A$18:$B$28,2,FALSE)","v":{"$error":"#N/A"}},{"$f":"VLOOKUP(data!G83,sleutels!$A$18:$B$28,2,FALSE)","v":{"$error":"#N/A"}},{"$f":"data!I83","v":""},{"$f":"data!J83","v":""},{"$f":"IF(data!L83=\"\",\"\",IF(data!L83=1,sleutels!$B$31,IF(data!L83=2,sleutels!$B$32,IF(data!L83=3,sleutels!$B$33))))","v":""},{"$f":"data!M83","v":""},{"$f":"data!AB83","v":0},{"$f":"data!AC83","v":0}]
[{"$f":"data!Q84","v":0},{"$f":"data!R84","v":0},{"$f":"data!S84","v":0},{"$f":"data!T84","v":0},{"$f":"data!U84","v":0},{"$f":"VLOOKUP(data!F84,sleutels!$A$18:$B$28,2,FALSE)","v":{"$error":"#N/A"}},{"$f":"VLOOKUP(data!G84,sleutels!$A$18:$B$28,2,FALSE)","v":{"$error":"#N/A"}},{"$f":"data!I84","v":""},{"$f":"data!J84","v":""},{"$f":"IF(data!L84=\"\",\"\",IF(data!L84=1,sleutels!$B$31,IF(data!L84=2,sleutels!$B$32,IF(data!L84=3,sleutels!$B$33))))","v":""},{"$f":"data!M84","v":""},{"$f":"data!AB84","v":0},{"$f":"data!AC84","v":0}]
[{"$f":"data!Q85","v":0},{"$f":"data!R85","v":0},{"$f":"data!S85","v":0},{"$f":"data!T85","v":0},{"$f":"data!U85","v":0},{"$f":"VLOOKUP(data!F85,sleutels!$A$18:$B$28,2,FALSE)","v":{"$error":"#N/A"}},{"$f":"VLOOKUP(data!G85,sleutels!$A$18:$B$28,2,FALSE)","v":{"$error":"#N/A"}},{"$f":"data!I85","v":""},{"$f":"data!J85","v":""},{"$f":"IF(data!L85=\"\",\"\",IF(data!L85=1,sleutels!$B$31,IF(data!L85=2,sleutels!$B$32,IF(data!L85=3,sleutels!$B$33))))","v":""},{"$f":"data!M85","v":""},{"$f":"data!AB85","v":0},{"$f":"data!AC85","v":0}]
[{"$f":"data!Q86","v":0},{"$f":"data!R86","v":0},{"$f":"data!S86","v":0},{"$f":"data!T86","v":0},{"$f":"data!U86","v":0},{"$f":"VLOOKUP(data!F86,sleutels!$A$18:$B$28,2,FALSE)","v":{"$error":"#N/A"}},{"$f":"VLOOKUP(data!G86,sleutels!$A$18:$B$28,2,FALSE)","v":{"$error":"#N/A"}},{"$f":"data!I86","v":""},{"$f":"data!J86","v":""},{"$f":"IF(data!L86=\"\",\"\",IF(data!L86=1,sleutels!$B$31,IF(data!L86=2,sleutels!$B$32,IF(data!L86=3,sleutels!$B$33))))","v":""},{"$f":"data!M86","v":""},{"$f":"data!AB86","v":0},{"$f":"data!AC86","v":0}]
[{"$f":"data!Q87","v":0},{"$f":"data!R87","v":0},{"$f":"data!S87","v":0},{"$f":"data!T87","v":0},{"$f":"data!U87","v":0},{"$f":"VLOOKUP(data!F87,sleutels!$A$18:$B$28,2,FALSE)","v":{"$error":"#N/A"}},{"$f":"VLOOKUP(data!G87,sleutels!$A$18:$B$28,2,FALSE)","v":{"$error":"#N/A"}},{"$f":"data!I87","v":""},{"$f":"data!J87","v":""},{"$f":"IF(data!L87=\"\",\"\",IF(data!L87=1,sleutels!$B$31,IF(data!L87=2,sleutels!$B$32,IF(data!L87=3,sleutels!$B$33))))","v":""},{"$f":"data!M87","v":""},{"$f":"data!AB87","v":0},{"$f":"data!AC87","v":0}]
[{"$f":"data!Q88","v":0},{"$f":"data!R88","v":0},{"$f":"data!S88","v":0},{"$f":"data!T88","v":0},{"$f":"data!U88","v":0},{"$f":"VLOOKUP(data!F88,sleutels!$A$18:$B$28,2,FALSE)","v":{"$error":"#N/A"}},{"$f":"VLOOKUP(data!G88,sleutels!$A$18:$B$28,2,FALSE)","v":{"$error":"#N/A"}},{"$f":"data!I88","v":""},{"$f":"data!J88","v":""},{"$f":"IF(data!L88=\"\",\"\",IF(data!L88=1,sleutels!$B$31,IF(data!L88=2,sleutels!$B$32,IF(data!L88=3,sleutels!$B$33))))","v":""},{"$f":"data!M88","v":""},{"$f":"data!AB88","v":0},{"$f":"data!AC88","v":0}]
[{"$f":"data!Q89","v":0},{"$f":"data!R89","v":0},{"$f":"data!S89","v":0},{"$f":"data!T89","v":0},{"$f":"data!U89","v":0},{"$f":"VLOOKUP(data!F89,sleutels!$A$18:$B$28,2,FALSE)","v":{"$error":"#N/A"}},{"$f":"VLOOKUP(data!G89,sleutels!$A$18:$B$28,2,FALSE)","v":{"$error":"#N/A"}},{"$f":"data!I89","v":""},{"$f":"data!J89","v":""},{"$f":"IF(data!L89=\"\",\"\",IF(data!L89=1,sleutels!$B$31,IF(data!L89=2,sleutels!$B$32,IF(data!L89=3,sleutels!$B$33))))","v":""},{"$f":"data!M89","v":""},{"$f":"data!AB89","v":0},{"$f":"data!AC89","v":0}]
[{"$f":"data!Q90","v":0},{"$f":"data!R90","v":0},{"$f":"data!S90","v":0},{"$f":"data!T90","v":0},{"$f":"data!U90","v":0},{"$f":"VLOOKUP(data!F90,sleutels!$A$18:$B$28,2,FALSE)","v":{"$error":"#N/A"}},{"$f":"VLOOKUP(data!G90,sleutels!$A$18:$B$28,2,FALSE)","v":{"$error":"#N/A"}},{"$f":"data!I90","v":""},{"$f":"data!J90","v":""},{"$f":"IF(data!L90=\"\",\"\",IF(data!L90=1,sleutels!$B$31,IF(data!L90=2,sleutels!$B$32,IF(data!L90=3,sleutels!$B$33))))","v":""},{"$f":"data!M90","v":""},{"$f":"data!AB90","v":0},{"$f":"data!AC90","v":0}]
[{"$f":"data!Q91","v":0},{"$f":"data!R91","v":0},{"$f":"data!S91","v":0},{"$f":"data!T91","v":0},{"$f":"data!U91","v":0},{"$f":"VLOOKUP(data!F91,sleutels!$A$18:$B$28,2,FALSE)","v":{"$error":"#N/A"}},{"$f":"VLOOKUP(data!G91,sleutels!$A$18:$B$28,2,FALSE)","v":{"$error":"#N/A"}},{"$f":"data!I91","v":""},{"$f":"data!J91","v":""},{"$f":"IF(data!L91=\"\",\"\",IF(data!L91=1,sleutels!$B$31,IF(data!L91=2,sleutels!$B$32,IF(data!L91=3,sleutels!$B$33))))","v":""},{"$f":"data!M91","v":""},{"$f":"data!AB91","v":0},{"$f":"data!AC91","v":0}]
[{"$f":"data!Q92","v":0},{"$f":"data!R92","v":0},{"$f":"data!S92","v":0},{"$f":"data!T92","v":0},{"$f":"data!U92","v":0},{"$f":"VLOOKUP(data!F92,sleutels!$A$18:$B$28,2,FALSE)","v":{"$error":"#N/A"}},{"$f":"VLOOKUP(data!G92,sleutels!$A$18:$B$28,2,FALSE)","v":{"$error":"#N/A"}},{"$f":"data!I92","v":""},{"$f":"data!J92","v":""},{"$f":"IF(data!L92=\"\",\"\",IF(data!L92=1,sleutels!$B$31,IF(data!L92=2,sleutels!$B$32,IF(data!L92=3,sleutels!$B$33))))","v":""},{"$f":"data!M92","v":""},{"$f":"data!AB92","v":0},{"$f":"data!AC92","v":0}]
[{"$f":"data!Q93","v":0},{"$f":"data!R93","v":0},{"$f":"data!S93","v":0},{"$f":"data!T93","v":0},{"$f":"data!U93","v":0},{"$f":"VLOOKUP(data!F93,sleutels!$A$18:$B$28,2,FALSE)","v":{"$error":"#N/A"}},{"$f":"VLOOKUP(data!G93,sleutels!$A$18:$B$28,2,FALSE)","v":{"$error":"#N/A"}},{"$f":"data!I93","v":""},{"$f":"data!J93","v":""},{"$f":"IF(data!L93=\"\",\"\",IF(data!L93=1,sleutels!$B$31,IF(data!L93=2,sleutels!$B$32,IF(data!L93=3,sleutels!$B$33))))","v":""},{"$f":"data!M93","v":""},{"$f":"data!AB93","v":0},{"$f":"data!AC93","v":0}]
[{"$f":"data!Q94","v":0},{"$f":"data!R94","v":0},{"$f":"data!S94","v":0},{"$f":"data!T94","v":0},{"$f":"data!U94","v":0},{"$f":"VLOOKUP(data!F94,sleutels!$A$18:$B$28,2,FALSE)","v":{"$error":"#N/A"}},{"$f":"VLOOKUP(data!G94,sleutels!$A$18:$B$28,2,FALSE)","v":{"$error":"#N/A"}},{"$f":"data!I94","v":""},{"$f":"data!J94","v":""},{"$f":"IF(data!L94=\"\",\"\",IF(data!L94=1,sleutels!$B$31,IF(data!L94=2,sleutels!$B$32,IF(data!L94=3,sleutels!$B$33))))","v":""},{"$f":"data!M94","v":""},{"$f":"data!AB94","v":0},{"$f":"data!AC94","v":0}]
[{"$f":"data!Q95","v":0},{"$f":"data!R95","v":0},{"$f":"data!S95","v":0},{"$f":"data!T95","v":0},{"$f":"data!U95","v":0},{"$f":"VLOOKUP(data!F95,sleutels!$A$18:$B$28,2,FALSE)","v":{"$error":"#N/A"}},{"$f":"VLOOKUP(data!G95,sleutels!$A$18:$B$28,2,FALSE)","v":{"$error":"#N/A"}},{"$f":"data!I95","v":""},{"$f":"data!J95","v":""},{"$f":"IF(data!L95=\"\",\"\",IF(data!L95=1,sleutels!$B$31,IF(data!L95=2,sleutels!$B$32,IF(data!L95=3,sleutels!$B$33))))","v":""},{"$f":"data!M95","v":""},{"$f":"data!AB95","v":0},{"$f":"data!AC95","v":0}]
[{"$f":"data!Q96","v":0},{"$f":"data!R96","v":0},{"$f":"data!S96","v":0},{"$f":"data!T96","v":0},{"$f":"data!U96","v":0},{"$f":"VLOOKUP(data!F96,sleutels!$A$18:$B$28,2,FALSE)","v":{"$error":"#N/A"}},{"$f":"VLOOKUP(data!G96,sleutels!$A$18:$B$28,2,FALSE)","v":{"$error":"#N/A"}},{"$f":"data!I96","v":""},{"$f":"data!J96","v":""},{"$f":"IF(data!L96=\"\",\"\",IF(data!L96=1,sleutels!$B$31,IF(data!L96=2,sleutels!$B$32,IF(data!L96=3,sleutels!$B$33))))","v":""},{"$f":"data!M96","v":""},{"$f":"data!AB96","v":0},{"$f":"data!AC96","v":0}]
[{"$f":"data!Q97","v":0},{"$f":"data!R97","v":0},{"$f":"data!S97","v":0},{"$f":"data!T97","v":0},{"$f":"data!U97","v":0},{"$f":"VLOOKUP(data!F97,sleutels!$A$18:$B$28,2,FALSE)","v":{"$error":"#N/A"}},{"$f":"VLOOKUP(data!G97,sleutels!$A$18:$B$28,2,FALSE)","v":{"$error":"#N/A"}},{"$f":"data!I97","v":""},{"$f":"data!J97","v":""},{"$f":"IF(data!L97=\"\",\"\",IF(data!L97=1,sleutels!$B$31,IF(data!L97=2,sleutels!$B$32,IF(data!L97=3,sleutels!$B$33))))","v":""},{"$f":"data!M97","v":""},{"$f":"data!AB97","v":0},{"$f":"data!AC97","v":0}]
[{"$f":"data!Q98","v":0},{"$f":"data!R98","v":0},{"$f":"data!S98","v":0},{"$f":"data!T98","v":0},{"$f":"data!U98","v":0},{"$f":"VLOOKUP(data!F98,sleutels!$A$18:$B$28,2,FALSE)","v":{"$error":"#N/A"}},{"$f":"VLOOKUP(data!G98,sleutels!$A$18:$B$28,2,FALSE)","v":{"$error":"#N/A"}},{"$f":"data!I98","v":""},{"$f":"data!J98","v":""},{"$f":"IF(data!L98=\"\",\"\",IF(data!L98=1,sleutels!$B$31,IF(data!L98=2,sleutels!$B$32,IF(data!L98=3,sleutels!$B$33))))","v":""},{"$f":"data!M98","v":""},{"$f":"data!AB98","v":0},{"$f":"data!AC98","v":0}]
[{"$f":"data!Q99","v":0},{"$f":"data!R99","v":0},{"$f":"data!S99","v":0},{"$f":"data!T99","v":0},{"$f":"data!U99","v":0},{"$f":"VLOOKUP(data!F99,sleutels!$A$18:$B$28,2,FALSE)","v":{"$error":"#N/A"}},{"$f":"VLOOKUP(data!G99,sleutels!$A$18:$B$28,2,FALSE)","v":{"$error":"#N/A"}},{"$f":"data!I99","v":""},{"$f":"data!J99","v":""},{"$f":"IF(data!L99=\"\",\"\",IF(data!L99=1,sleutels!$B$31,IF(data!L99=2,sleutels!$B$32,IF(data!L99=3,sleutels!$B$33))))","v":""},{"$f":"data!M99","v":""},{"$f":"data!AB99","v":0},{"$f":"data!AC99","v":0}]
[{"$f":"data!Q100","v":0},{"$f":"data!R100","v":0},{"$f":"data!S100","v":0},{"$f":"data!T100","v":0},{"$f":"data!U100","v":0},{"$f":"VLOOKUP(data!F100,sleutels!$A$18:$B$28,2,FALSE)","v":{"$error":"#N/A"}},{"$f":"VLOOKUP(data!G100,sleutels!$A$18:$B$28,2,FALSE)","v":{"$error":"#N/A"}},{"$f":"data!I100","v":""},{"$f":"data!J100","v":""},{"$f":"IF(data!L100=\"\",\"\",IF(data!L100=1,sleutels!$B$31,IF(data!L100=2,sleutels!$B$32,IF(data!L100=3,sleutels!$B$33))))","v":""},{"$f":"data!M100","v":""},{"$f":"data!AB100","v":0},{"$f":"data!AC100","v":0}]
[{"$f":"data!Q101","v":0},{"$f":"data!R101","v":0},{"$f":"data!S101","v":0},{"$f":"data!T101","v":0},{"$f":"data!U101","v":0},{"$f":"VLOOKUP(data!F101,sleutels!$A$18:$B$28,2,FALSE)","v":{"$error":"#N/A"}},{"$f":"VLOOKUP(data!G101,sleutels!$A$18:$B$28,2,FALSE)","v":{"$error":"#N/A"}},{"$f":"data!I101","v":""},{"$f":"data!J101","v":""},{"$f":"IF(data!L101=\"\",\"\",IF(data!L101=1,sleutels!$B$31,IF(data!L101=2,sleutels!$B$32,IF(data!L101=3,sleutels!$B$33))))","v":""},{"$f":"data!M101","v":""},{"$f":"data!AB101","v":0},{"$f":"data!AC101","v":0}]
[{"$f":"data!Q102","v":0},{"$f":"data!R102","v":0},{"$f":"data!S102","v":0},{"$f":"data!T102","v":0},{"$f":"data!U102","v":0},{"$f":"VLOOKUP(data!F102,sleutels!$A$18:$B$28,2,FALSE)","v":{"$error":"#N/A"}},{"$f":"VLOOKUP(data!G102,sleutels!$A$18:$B$28,2,FALSE)","v":{"$error":"#N/A"}},{"$f":"data!I102","v":""},{"$f":"data!J102","v":""},{"$f":"IF(data!L102=\"\",\"\",IF(data!L102=1,sleutels!$B$31,IF(data!L102=2,sleutels!$B$32,IF(data!L102=3,sleutels!$B$33))))","v":""},{"$f":"data!M102","v":""},{"$f":"data!AB102","v":0},{"$f":"data!AC102","v":0}]
[{"$f":"data!Q103","v":0},{"$f":"data!R103","v":0},{"$f":"data!S103","v":0},{"$f":"data!T103","v":0},{"$f":"data!U103","v":0},{"$f":"VLOOKUP(data!F103,sleutels!$A$18:$B$28,2,FALSE)","v":{"$error":"#N/A"}},{"$f":"VLOOKUP(data!G103,sleutels!$A$18:$B$28,2,FALSE)","v":{"$error":"#N/A"}},{"$f":"data!I103","v":""},{"$f":"data!J103","v":""},{"$f":"IF(data!L103=\"\",\"\",IF(data!L103=1,sleutels!$B$31,IF(data!L103=2,sleutels!$B$32,IF(data!L103=3,sleutels!$B$33))))","v":""},{"$f":"data!M103","v":""},{"$f":"data!AB103","v":0},{"$f":"data!AC103","v":0}]
[{"$f":"data!Q104","v":0},{"$f":"data!R104","v":0},{"$f":"data!S104","v":0},{"$f":"data!T104","v":0},{"$f":"data!U104","v":0},{"$f":"VLOOKUP(data!F104,sleutels!$A$18:$B$28,2,FALSE)","v":{"$error":"#N/A"}},{"$f":"VLOOKUP(data!G104,sleutels!$A$18:$B$28,2,FALSE)","v":{"$error":"#N/A"}},{"$f":"data!I104","v":""},{"$f":"data!J104","v":""},{"$f":"IF(data!L104=\"\",\"\",IF(data!L104=1,sleutels!$B$31,IF(data!L104=2,sleutels!$B$32,IF(data!L104=3,sleutels!$B$33))))","v":""},{"$f":"data!M104","v":""},{"$f":"data!AB104","v":0},{"$f":"data!AC104","v":0}]
[{"$f":"data!Q105","v":0},{"$f":"data!R105","v":0},{"$f":"data!S105","v":0},{"$f":"data!T105","v":0},{"$f":"data!U105","v":0},{"$f":"VLOOKUP(data!F105,sleutels!$A$18:$B$28,2,FALSE)","v":{"$error":"#N/A"}},{"$f":"VLOOKUP(data!G105,sleutels!$A$18:$B$28,2,FALSE)","v":{"$error":"#N/A"}},{"$f":"data!I105","v":""},{"$f":"data!J105","v":""},{"$f":"IF(data!L105=\"\",\"\",IF(data!L105=1,sleutels!$B$31,IF(data!L105=2,sleutels!$B$32,IF(data!L105=3,sleutels!$B$33))))","v":""},{"$f":"data!M105","v":""},{"$f":"data!AB105","v":0},{"$f":"data!AC105","v":0}]
[{"$f":"data!Q106","v":0},{"$f":"data!R106","v":0},{"$f":"data!S106","v":0},{"$f":"data!T106","v":0},{"$f":"data!U106","v":0},{"$f":"VLOOKUP(data!F106,sleutels!$A$18:$B$28,2,FALSE)","v":{"$error":"#N/A"}},{"$f":"VLOOKUP(data!G106,sleutels!$A$18:$B$28,2,FALSE)","v":{"$error":"#N/A"}},{"$f":"data!I106","v":""},{"$f":"data!J106","v":""},{"$f":"IF(data!L106=\"\",\"\",IF(data!L106=1,sleutels!$B$31,IF(data!L106=2,sleutels!$B$32,IF(data!L106=3,sleutels!$B$33))))","v":""},{"$f":"data!M106","v":""},{"$f":"data!AB106","v":0},{"$f":"data!AC106","v":0}]
[{"$f":"data!Q107","v":0},{"$f":"data!R107","v":0},{"$f":"data!S107","v":0},{"$f":"data!T107","v":0},{"$f":"data!U107","v":0},{"$f":"VLOOKUP(data!F107,sleutels!$A$18:$B$28,2,FALSE)","v":{"$error":"#N/A"}},{"$f":"VLOOKUP(data!G107,sleutels!$A$18:$B$28,2,FALSE)","v":{"$error":"#N/A"}},{"$f":"data!I107","v":""},{"$f":"data!J107","v":""},{"$f":"IF(data!L107=\"\",\"\",IF(data!L107=1,sleutels!$B$31,IF(data!L107=2,sleutels!$B$32,IF(data!L107=3,sleutels!$B$33))))","v":""},{"$f":"data!M107","v":""},{"$f":"data!AB107","v":0},{"$f":"data!AC107","v":0}]
[{"$f":"data!Q108","v":0},{"$f":"data!R108","v":0},{"$f":"data!S108","v":0},{"$f":"data!T108","v":0},{"$f":"data!U108","v":0},{"$f":"VLOOKUP(data!F108,sleutels!$A$18:$B$28,2,FALSE)","v":{"$error":"#N/A"}},{"$f":"VLOOKUP(data!G108,sleutels!$A$18:$B$28,2,FALSE)","v":{"$error":"#N/A"}},{"$f":"data!I108","v":""},{"$f":"data!J108","v":""},{"$f":"IF(data!L108=\"\",\"\",IF(data!L108=1,sleutels!$B$31,IF(data!L108=2,sleutels!$B$32,IF(data!L108=3,sleutels!$B$33))))","v":""},{"$f":"data!M108","v":""},{"$f":"data!AB108","v":0},{"$f":"data!AC108","v":0}]
[{"$f":"data!Q109","v":0},{"$f":"data!R109","v":0},{"$f":"data!S109","v":0},{"$f":"data!T109","v":0},{"$f":"data!U109","v":0},{"$f":"VLOOKUP(data!F109,sleutels!$A$18:$B$28,2,FALSE)","v":{"$error":"#N/A"}},{"$f":"VLOOKUP(data!G109,sleutels!$A$18:$B$28,2,FALSE)","v":{"$error":"#N/A"}},{"$f":"data!I109","v":""},{"$f":"data!J109","v":""},{"$f":"IF(data!L109=\"\",\"\",IF(data!L109=1,sleutels!$B$31,IF(data!L109=2,sleutels!$B$32,IF(data!L109=3,sleutels!$B$33))))","v":""},{"$f":"data!M109","v":""},{"$f":"data!AB109","v":0},{"$f":"data!AC109","v":0}]
[{"$f":"data!Q110","v":0},{"$f":"data!R110","v":0},{"$f":"data!S110","v":0},{"$f":"data!T110","v":0},{"$f":"data!U110","v":0},{"$f":"VLOOKUP(data!F110,sleutels!$A$18:$B$28,2,FALSE)","v":{"$error":"#N/A"}},{"$f":"VLOOKUP(data!G110,sleutels!$A$18:$B$28,2,FALSE)","v":{"$error":"#N/A"}},{"$f":"data!I110","v":""},{"$f":"data!J110","v":""},{"$f":"IF(data!L110=\"\",\"\",IF(data!L110=1,sleutels!$B$31,IF(data!L110=2,sleutels!$B$32,IF(data!L110=3,sleutels!$B$33))))","v":""},{"$f":"data!M110","v":""},{"$f":"data!AB110","v":0},{"$f":"data!AC110","v":0}]
[{"$f":"data!Q111","v":0},{"$f":"data!R111","v":0},{"$f":"data!S111","v":0},{"$f":"data!T111","v":0},{"$f":"data!U111","v":0},{"$f":"VLOOKUP(data!F111,sleutels!$A$18:$B$28,2,FALSE)","v":{"$error":"#N/A"}},{"$f":"VLOOKUP(data!G111,sleutels!$A$18:$B$28,2,FALSE)","v":{"$error":"#N/A"}},{"$f":"data!I111","v":""},{"$f":"data!J111","v":""},{"$f":"IF(data!L111=\"\",\"\",IF(data!L111=1,sleutels!$B$31,IF(data!L111=2,sleutels!$B$32,IF(data!L111=3,sleutels!$B$33))))","v":""},{"$f":"data!M111","v":""},{"$f":"data!AB111","v":0},{"$f":"data!AC111","v":0}]
[{"$f":"data!Q112","v":0},{"$f":"data!R112","v":0},{"$f":"data!S112","v":0},{"$f":"data!T112","v":0},{"$f":"data!U112","v":0},{"$f":"VLOOKUP(data!F112,sleutels!$A$18:$B$28,2,FALSE)","v":{"$error":"#N/A"}},{"$f":"VLOOKUP(data!G112,sleutels!$A$18:$B$28,2,FALSE)","v":{"$error":"#N/A"}},{"$f":"data!I112","v":""},{"$f":"data!J112","v":""},{"$f":"IF(data!L112=\"\",\"\",IF(data!L112=1,sleutels!$B$31,IF(data!L112=2,sleutels!$B$32,IF(data!L112=3,sleutels!$B$33))))","v":""},{"$f":"data!M112","v":""},{"$f":"data!AB112","v":0},{"$f":"data!AC112","v":0}]
[{"$f":"data!Q113","v":0},{"$f":"data!R113","v":0},{"$f":"data!S113","v":0},{"$f":"data!T113","v":0},{"$f":"data!U113","v":0},{"$f":"VLOOKUP(data!F113,sleutels!$A$18:$B$28,2,FALSE)","v":{"$error":"#N/A"}},{"$f":"VLOOKUP(data!G113,sleutels!$A$18:$B$28,2,FALSE)","v":{"$error":"#N/A"}},{"$f":"data!I113","v":""},{"$f":"data!J113","v":""},{"$f":"IF(data!L113=\"\",\"\",IF(data!L113=1,sleutels!$B$31,IF(data!L113=2,sleutels!$B$32,IF(data!L113=3,sleutels!$B$33))))","v":""},{"$f":"data!M113","v":""},{"$f":"data!AB113","v":0},{"$f":"data!AC113","v":0}]
[{"$f":"data!Q114","v":0},{"$f":"data!R114","v":0},{"$f":"data!S114","v":0},{"$f":"data!T114","v":0},{"$f":"data!U114","v":0},{"$f":"VLOOKUP(data!F114,sleutels!$A$18:$B$28,2,FALSE)","v":{"$error":"#N/A"}},{"$f":"VLOOKUP(data!G114,sleutels!$A$18:$B$28,2,FALSE)","v":{"$error":"#N/A"}},{"$f":"data!I114","v":""},{"$f":"data!J114","v":""},{"$f":"IF(data!L114=\"\",\"\",IF(data!L114=1,sleutels!$B$31,IF(data!L114=2,sleutels!$B$32,IF(data!L114=3,sleutels!$B$33))))","v":""},{"$f":"data!M114","v":""},{"$f":"data!AB114","v":0},{"$f":"data!AC114","v":0}]
[{"$f":"data!Q115","v":0},{"$f":"data!R115","v":0},{"$f":"data!S115","v":0},{"$f":"data!T115","v":0},{"$f":"data!U115","v":0},{"$f":"VLOOKUP(data!F115,sleutels!$A$18:$B$28,2,FALSE)","v":{"$error":"#N/A"}},{"$f":"VLOOKUP(data!G115,sleutels!$A$18:$B$28,2,FALSE)","v":{"$error":"#N/A"}},{"$f":"data!I115","v":""},{"$f":"data!J115","v":""},{"$f":"IF(data!L115=\"\",\"\",IF(data!L115=1,sleutels!$B$31,IF(data!L115=2,sleutels!$B$32,IF(data!L115=3,sleutels!$B$33))))","v":""},{"$f":"data!M115","v":""},{"$f":"data!AB115","v":0},{"$f":"data!AC115","v":0}]
[{"$f":"data!Q116","v":0},{"$f":"data!R116","v":0},{"$f":"data!S116","v":0},{"$f":"data!T116","v":0},{"$f":"data!U116","v":0},{"$f":"VLOOKUP(data!F116,sleutels!$A$18:$B$28,2,FALSE)","v":{"$error":"#N/A"}},{"$f":"VLOOKUP(data!G116,sleutels!$A$18:$B$28,2,FALSE)","v":{"$error":"#N/A"}},{"$f":"data!I116","v":""},{"$f":"data!J116","v":""},{"$f":"IF(data!L116=\"\",\"\",IF(data!L116=1,sleutels!$B$31,IF(data!L116=2,sleutels!$B$32,IF(data!L116=3,sleutels!$B$33))))","v":""},{"$f":"data!M116","v":""},{"$f":"data!AB116","v":0},{"$f":"data!AC116","v":0}]

{"sheet":"dataTabellen","index":9,"n_rows":70,"n_cols":21,"rows_kept":70,"cut":false,"hidden":true,"merged":[]}
[{"$f":"data!A124","v":"Materiaalstromen"}]
[{"$f":"data!A125","v":"id_CA"},{"$f":"data!B125","v":"RapportJaar"},{"$f":"data!C125","v":"invuldatum"},{"$f":"data!D125","v":"Q11_Materiaal"},{"$f":"data!E125","v":"Q11_MilieustraatBS"},{"$f":"data!F125","v":"Q11_KringloopwinkelBS"},{"$f":"data!G125","v":"Q11_RepairCafeBS"},{"$f":"data!H125","v":"Q11_SociaalmaatschappelijkBS"},{"$f":"data!I125","v":"Q11_OnderwijsBS"},{"$f":"data!J125","v":"Q11_WerkplaatsBS"},{"$f":"data!K125","v":"Q11_DeeleconomieBS"},{"$f":"data!L125","v":"Q11_OndernemersBS"},{"$f":"data!M125","v":"Q11_DemontageBS"},{"$f":"data!N125","v":"Q11_AlternatiefElementBS"},{"$f":"data!O125","v":"Q12_DirectHergebruikH"},{"$f":"data!P125","v":"Q12_HergebruikNaReparerenH"},{"$f":"data!Q125","v":"Q12_RepurposeH"},{"$f":"data!R125","v":"Q12_LesmateriaalH"},{"$f":"data!S125","v":"Q12_DemontageVoorHergebruikH"},{"$f":"data!T125","v":"Q12_DemontageVoorRecyclingH"},{"$f":"data!U125","v":"Q12_AndersH"}]
[{"$f":"data!A126","v":1001},{"$f":"data!B126","v":"2025"},{"$f":"data!C126","v":0},{"$f":"data!D126","v":"Elektrische apparaten"},{"$f":"data!E126","v":0},{"$f":"data!F126","v":0},{"$f":"data!G126","v":0},{"$f":"data!H126","v":0},{"$f":"data!I126","v":0},{"$f":"data!J126","v":0},{"$f":"data!K126","v":0},{"$f":"data!L126","v":0},{"$f":"data!M126","v":0},{"$f":"data!N126","v":0},{"$f":"data!O126","v":0},{"$f":"data!P126","v":0},{"$f":"data!Q126","v":0},{"$f":"data!R126","v":0},{"$f":"data!S126","v":0},{"$f":"data!T126","v":0},{"$f":"data!U126","v":0}]
[{"$f":"data!A127","v":1001},{"$f":"data!B127","v":"2025"},{"$f":"data!C127","v":0},{"$f":"data!D127","v":"Fietsen"},{"$f":"data!E127","v":0},{"$f":"data!F127","v":0},{"$f":"data!G127","v":0},{"$f":"data!H127","v":0},{"$f":"data!I127","v":0},{"$f":"data!J127","v":0},{"$f":"data!K127","v":0},{"$f":"data!L127","v":0},{"$f":"data!M127","v":0},{"$f":"data!N127","v":0},{"$f":"data!O127","v":0},{"$f":"data!P127","v":0},{"$f":"data!Q127","v":0},{"$f":"data!R127","v":0},{"$f":"data!S127","v":0},{"$f":"data!T127","v":0},{"$f":"data!U127","v":0}]
[{"$f":"data!A128","v":1001},{"$f":"data!B128","v":"2025"},{"$f":"data!C128","v":0},{"$f":"data!D128","v":"Meubilair en onderdelen"},{"$f":"data!E128","v":0},{"$f":"data!F128","v":0},{"$f":"data!G128","v":0},{"$f":"data!H128","v":0},{"$f":"data!I128","v":0},{"$f":"data!J128","v":0},{"$f":"data!K128","v":0},{"$f":"data!L128","v":0},{"$f":"data!M128","v":0},{"$f":"data!N128","v":0},{"$f":"data!O128","v":0},{"$f":"data!P128","v":0},{"$f":"data!Q128","v":0},{"$f":"data!R128","v":0},{"$f":"data!S128","v":0},{"$f":"data!T128","v":0},{"$f":"data!U128","v":0}]
[{"$f":"data!A129","v":1001},{"$f":"data!B129","v":"2025"},{"$f":"data!C129","v":0},{"$f":"data!D129","v":"Textiel"},{"$f":"data!E129","v":0},{"$f":"data!F129","v":0},{"$f":"data!G129","v":0},{"$f":"data!H129","v":0},{"$f":"data!I129","v":0},{"$f":"data!J129","v":0},{"$f":"data!K129","v":0},{"$f":"data!L129","v":0},{"$f":"data!M129","v":0},{"$f":"data!N129","v":0},{"$f":"data!O129","v":0},{"$f":"data!P129","v":0},{"$f":"data!Q129","v":0},{"$f":"data!R129","v":0},{"$f":"data!S129","v":0},{"$f":"data!T129","v":0},{"$f":"data!U129","v":0}]
[{"$f":"data!A130","v":1001},{"$f":"data!B130","v":"2025"},{"$f":"data!C130","v":0},{"$f":"data!D130","v":"Metaal / staal"},{"$f":"data!E130","v":0},{"$f":"data!F130","v":0},{"$f":"data!G130","v":0},{"$f":"data!H130","v":0},{"$f":"data!I130","v":0},{"$f":"data!J130","v":0},{"$f":"data!K130","v":0},{"$f":"data!L130","v":0},{"$f":"data!M130","v":0},{"$f":"data!N130","v":0},{"$f":"data!O130","v":0},{"$f":"data!P130","v":0},{"$f":"data!Q130","v":0},{"$f":"data!R130","v":0},{"$f":"data!S130","v":0},{"$f":"data!T130","v":0},{"$f":"data!U130","v":0}]
[{"$f":"data!A131","v":1001},{"$f":"data!B131","v":"2025"},{"$f":"data!C131","v":0},{"$f":"data!D131","v":"Hout (balken, plaatmateriaal)"},{"$f":"data!E131","v":0},{"$f":"data!F131","v":0},{"$f":"data!G131","v":0},{"$f":"data!H131","v":0},{"$f":"data!I131","v":0},{"$f":"data!J131","v":0},{"$f":"data!K131","v":0},{"$f":"data!L131","v":0},{"$f":"data!M131","v":0},{"$f":"data!N131","v":0},{"$f":"data!O131","v":0},{"$f":"data!P131","v":0},{"$f":"data!Q131","v":0},{"$f":"data!R131","v":0},{"$f":"data!S131","v":0},{"$f":"data!T131","v":0},{"$f":"data!U131","v":0}]
[{"$f":"data!A132","v":1001},{"$f":"data!B132","v":"2025"},{"$f":"data!C132","v":0},{"$f":"data!D132","v":"Overige bouwmaterialen (anders dan hout en metaal)"},{"$f":"data!E132","v":0},{"$f":"data!F132","v":0},{"$f":"data!G132","v":0},{"$f":"data!H132","v":0},{"$f":"data!I132","v":0},{"$f":"data!J132","v":0},{"$f":"data!K132","v":0},{"$f":"data!L132","v":0},{"$f":"data!M132","v":0},{"$f":"data!N132","v":0},{"$f":"data!O132","v":0},{"$f":"data!P132","v":0},{"$f":"data!Q132","v":0},{"$f":"data!R132","v":0},{"$f":"data!S132","v":0},{"$f":"data!T132","v":0},{"$f":"data!U132","v":0}]
[{"$f":"data!A133","v":1001},{"$f":"data!B133","v":"2025"},{"$f":"data!C133","v":0},{"$f":"data!D133","v":0},{"$f":"data!E133","v":0},{"$f":"data!F133","v":0},{"$f":"data!G133","v":0},{"$f":"data!H133","v":0},{"$f":"data!I133","v":0},{"$f":"data!J133","v":0},{"$f":"data!K133","v":0},{"$f":"data!L133","v":0},{"$f":"data!M133","v":0},{"$f":"data!N133","v":0},{"$f":"data!O133","v":0},{"$f":"data!P133","v":0},{"$f":"data!Q133","v":0},{"$f":"data!R133","v":0},{"$f":"data!S133","v":0},{"$f":"data!T133","v":0},{"$f":"data!U133","v":0}]
[{"$f":"data!A134","v":1001},{"$f":"data!B134","v":"2025"},{"$f":"data!C134","v":0},{"$f":"data!D134","v":0},{"$f":"data!E134","v":0},{"$f":"data!F134","v":0},{"$f":"data!G134","v":0},{"$f":"data!H134","v":0},{"$f":"data!I134","v":0},{"$f":"data!J134","v":0},{"$f":"data!K134","v":0},{"$f":"data!L134","v":0},{"$f":"data!M134","v":0},{"$f":"data!N134","v":0},{"$f":"data!O134","v":0},{"$f":"data!P134","v":0},{"$f":"data!Q134","v":0},{"$f":"data!R134","v":0},{"$f":"data!S134","v":0},{"$f":"data!T134","v":0},{"$f":"data!U134","v":0}]
[{"$f":"data!A135","v":1001},{"$f":"data!B135","v":"2025"},{"$f":"data!C135","v":0},{"$f":"data!D135","v":0},{"$f":"data!E135","v":0},{"$f":"data!F135","v":0},{"$f":"data!G135","v":0},{"$f":"data!H135","v":0},{"$f":"data!I135","v":0},{"$f":"data!J135","v":0},{"$f":"data!K135","v":0},{"$f":"data!L135","v":0},{"$f":"data!M135","v":0},{"$f":"data!N135","v":0},{"$f":"data!O135","v":0},{"$f":"data!P135","v":0},{"$f":"data!Q135","v":0},{"$f":"data!R135","v":0},{"$f":"data!S135","v":0},{"$f":"data!T135","v":0},{"$f":"data!U135","v":0}]
[{"$f":"data!A136","v":1001},{"$f":"data!B136","v":"2025"},{"$f":"data!C136","v":0},{"$f":"data!D136","v":0},{"$f":"data!E136","v":0},{"$f":"data!F136","v":0},{"$f":"data!G136","v":0},{"$f":"data!H136","v":0},{"$f":"data!I136","v":0},{"$f":"data!J136","v":0},{"$f":"data!K136","v":0},{"$f":"data!L136","v":0},{"$f":"data!M136","v":0},{"$f":"data!N136","v":0},{"$f":"data!O136","v":0},{"$f":"data!P136","v":0},{"$f":"data!Q136","v":0},{"$f":"data!R136","v":0},{"$f":"data!S136","v":0},{"$f":"data!T136","v":0},{"$f":"data!U136","v":0}]
[]
[]
[{"$f":"data!A147","v":"Reparatie"}]
[{"$f":"data!A152","v":"id_CA"},{"$f":"data!B152","v":"RapportJaar"},{"$f":"data!C152","v":"invuldatum"},{"$f":"data!D152","v":"Q17_Reparatieorganiatie"},{"$f":"data!E152","v":"Q17_Aanwezig"},{"$f":"data!F152","v":"Q17_Particulieren"},{"$f":"data!G152","v":"Q17_Zakelijk"},{"$f":"data!H152","v":"Q17_AndersNamelijk"}]
[{"$f":"data!A153","v":1001},{"$f":"data!B153","v":"2025"},{"$f":"data!C153","v":0},{"$f":"data!D153","v":"RepairCafé"},{"$f":"data!E153","v":{"$error":"#VALUE!"}},{"$f":"data!F153","v":0},{"$f":"data!G153","v":0}]
[{"$f":"data!A154","v":1001},{"$f":"data!B154","v":"2025"},{"$f":"data!C154","v":0},{"$f":"data!D154","v":"SociaalDomein"},{"$f":"data!E154","v":{"$error":"#VALUE!"}},{"$f":"data!F154","v":0},{"$f":"data!G154","v":0}]
[{"$f":"data!A155","v":1001},{"$f":"data!B155","v":"2025"},{"$f":"data!C155","v":0},{"$f":"data!D155","v":"Kringloop"},{"$f":"data!E155","v":{"$error":"#VALUE!"}},{"$f":"data!F155","v":0},{"$f":"data!G155","v":0}]
[{"$f":"data!A156","v":1001},{"$f":"data!B156","v":"2025"},{"$f":"data!C156","v":0},{"$f":"data!D156","v":"CommercieelReparatiebedrijf"},{"$f":"data!E156","v":{"$error":"#VALUE!"}},{"$f":"data!F156","v":0},{"$f":"data!G156","v":0}]
[{"$f":"data!A157","v":1001},{"$f":"data!B157","v":"2025"},{"$f":"data!C157","v":0},{"$f":"data!D157","v":"DIY"},{"$f":"data!E157","v":{"$error":"#VALUE!"}},{"$f":"data!F157","v":0},{"$f":"data!G157","v":0}]
[{"$f":"data!A158","v":1001},{"$f":"data!B158","v":"2025"},{"$f":"data!C158","v":0},{"$f":"data!D158","v":"Anders"},{"$f":"data!E158","v":{"$error":"#VALUE!"}},{"$f":"data!F158","v":0},{"$f":"data!G158","v":0},{"$f":"data!H158","v":0}]
[]
[]
[{"$f":"data!A161","v":"id_CA"},{"$f":"data!B161","v":"RapportJaar"},{"$f":"data!C161","v":"invuldatum"},{"$f":"data!D161","v":"Q23_InitiatiefReparatie"},{"$f":"data!E161","v":"Q23_Start"},{"$f":"data!F161","v":"Q23_Status"}]
[{"$f":"data!A162","v":1001},{"$f":"data!B162","v":"2025"},{"$f":"data!C162","v":0},{"$f":"data!D162","v":0},{"$f":"data!E162","v":0},{"$f":"data!F162","v":0}]
[{"$f":"data!A163","v":1001},{"$f":"data!B163","v":"2025"},{"$f":"data!C163","v":0},{"$f":"data!D163","v":0},{"$f":"data!E163","v":0},{"$f":"data!F163","v":0}]
[{"$f":"data!A164","v":1001},{"$f":"data!B164","v":"2025"},{"$f":"data!C164","v":0},{"$f":"data!D164","v":0},{"$f":"data!E164","v":0},{"$f":"data!F164","v":0}]
[{"$f":"data!A165","v":1001},{"$f":"data!B165","v":"2025"},{"$f":"data!C165","v":0},{"$f":"data!D165","v":0},{"$f":"data!E165","v":0},{"$f":"data!F165","v":0}]
[{"$f":"data!A166","v":1001},{"$f":"data!B166","v":"2025"},{"$f":"data!C166","v":0},{"$f":"data!D166","v":0},{"$f":"data!E166","v":0},{"$f":"data!F166","v":0}]
[{"$f":"data!A167","v":1001},{"$f":"data!B167","v":"2025"},{"$f":"data!C167","v":0},{"$f":"data!D167","v":0},{"$f":"data!E167","v":0},{"$f":"data!F167","v":0}]
[{"$f":"data!A168","v":1001},{"$f":"data!B168","v":"2025"},{"$f":"data!C168","v":0},{"$f":"data!D168","v":0},{"$f":"data!E168","v":0},{"$f":"data!F168","v":0}]
[{"$f":"data!A169","v":1001},{"$f":"data!B169","v":"2025"},{"$f":"data!C169","v":0},{"$f":"data!D169","v":0},{"$f":"data!E169","v":0},{"$f":"data!F169","v":0}]
[{"$f":"data!A170","v":1001},{"$f":"data!B170","v":"2025"},{"$f":"data!C170","v":0},{"$f":"data!D170","v":0},{"$f":"data!E170","v":0},{"$f":"data!F170","v":0}]
[{"$f":"data!A171","v":1001},{"$f":"data!B171","v":"2025"},{"$f":"data!C171","v":0},{"$f":"data!D171","v":0},{"$f":"data!E171","v":0},{"$f":"data!F171","v":0}]
[{"$f":"data!A172","v":1001},{"$f":"data!B172","v":"2025"},{"$f":"data!C172","v":0},{"$f":"data!D172","v":0},{"$f":"data!E172","v":0},{"$f":"data!F172","v":0}]
[]
[]
[{"$f":"data!A181","v":"Inclusief werkgeverschap"}]
[{"$f":"data!A186","v":"id_CA"},{"$f":"data!B186","v":"RapportJaar"},{"$f":"data!C186","v":"invuldatum"},{"$f":"data!D186","v":"Q31_InitiatiefSA"},{"$f":"data!E186","v":"Q31_Start"},{"$f":"data!F186","v":"Q31_Status"}]
[{"$f":"data!A187","v":1001},{"$f":"data!B187","v":"2025"},{"$f":"data!C187","v":0},{"$f":"data!D187","v":0},{"$f":"data!E187","v":0},{"$f":"data!F187","v":0}]
[{"$f":"data!A188","v":1001},{"$f":"data!B188","v":"2025"},{"$f":"data!C188","v":0},{"$f":"data!D188","v":0},{"$f":"data!E188","v":0},{"$f":"data!F188","v":0}]
[{"$f":"data!A189","v":1001},{"$f":"data!B189","v":"2025"},{"$f":"data!C189","v":0},{"$f":"data!D189","v":0},{"$f":"data!E189","v":0},{"$f":"data!F189","v":0}]
[{"$f":"data!A190","v":1001},{"$f":"data!B190","v":"2025"},{"$f":"data!C190","v":0},{"$f":"data!D190","v":0},{"$f":"data!E190","v":0},{"$f":"data!F190","v":0}]
[{"$f":"data!A191","v":1001},{"$f":"data!B191","v":"2025"},{"$f":"data!C191","v":0},{"$f":"data!D191","v":0},{"$f":"data!E191","v":0},{"$f":"data!F191","v":0}]
[{"$f":"data!A192","v":1001},{"$f":"data!B192","v":"2025"},{"$f":"data!C192","v":0},{"$f":"data!D192","v":0},{"$f":"data!E192","v":0},{"$f":"data!F192","v":0}]
[{"$f":"data!A193","v":1001},{"$f":"data!B193","v":"2025"},{"$f":"data!C193","v":0},{"$f":"data!D193","v":0},{"$f":"data!E193","v":0},{"$f":"data!F193","v":0}]
[{"$f":"data!A194","v":1001},{"$f":"data!B194","v":"2025"},{"$f":"data!C194","v":0},{"$f":"data!D194","v":0},{"$f":"data!E194","v":0},{"$f":"data!F194","v":0}]
[{"$f":"data!A195","v":1001},{"$f":"data!B195","v":"2025"},{"$f":"data!C195","v":0},{"$f":"data!D195","v":0},{"$f":"data!E195","v":0},{"$f":"data!F195","v":0}]
[{"$f":"data!A196","v":1001},{"$f":"data!B196","v":"2025"},{"$f":"data!C196","v":0},{"$f":"data!D196","v":0},{"$f":"data!E196","v":0},{"$f":"data!F196","v":0}]
[{"$f":"data!A197","v":1001},{"$f":"data!B197","v":"2025"},{"$f":"data!C197","v":0},{"$f":"data!D197","v":0},{"$f":"data!E197","v":0},{"$f":"data!F197","v":0}]
[]
[]
[{"$f":"data!A200","v":"Economisch"}]
[{"$f":"data!A205","v":"id_CA"},{"$f":"data!B205","v":"RapportJaar"},{"$f":"data!C205","v":"invuldatum"},{"$f":"data!D205","v":"Q40_OndernemendePartner"},{"$f":"data!E205","v":"Q40_B2B"},{"$f":"data!F205","v":"Q40_B2C"}]
[{"$f":"data!A206","v":1001},{"$f":"data!B206","v":"2025"},{"$f":"data!C206","v":0},{"$f":"data!D206","v":0},{"$f":"data!E206","v":0},{"$f":"data!F206","v":0}]
[{"$f":"data!A207","v":1001},{"$f":"data!B207","v":"2025"},{"$f":"data!C207","v":0},{"$f":"data!D207","v":0},{"$f":"data!E207","v":0},{"$f":"data!F207","v":0}]
[{"$f":"data!A208","v":1001},{"$f":"data!B208","v":"2025"},{"$f":"data!C208","v":0},{"$f":"data!D208","v":0},{"$f":"data!E208","v":0},{"$f":"data!F208","v":0}]
[{"$f":"data!A209","v":1001},{"$f":"data!B209","v":"2025"},{"$f":"data!C209","v":0},{"$f":"data!D209","v":0},{"$f":"data!E209","v":0},{"$f":"data!F209","v":0}]
[{"$f":"data!A210","v":1001},{"$f":"data!B210","v":"2025"},{"$f":"data!C210","v":0},{"$f":"data!D210","v":0},{"$f":"data!E210","v":0},{"$f":"data!F210","v":0}]
[]
[]
[{"$f":"data!A213","v":"Bekendheid bij publiek"}]
[{"$f":"data!A217","v":"id_CA"},{"$f":"data!B217","v":"RapportJaar"},{"$f":"data!C217","v":"invuldatum"},{"$f":"data!D217","v":"Q47_TypePresentie"},{"$f":"data!E217","v":"Q47_bestaat"},{"$f":"data!F217","v":"Q47_Link"},{"$f":"data!G217","v":"Q47_Bezoekers/Volgers"}]
[{"$f":"data!A218","v":1001},{"$f":"data!B218","v":"2025"},{"$f":"data!C218","v":0},{"$f":"data!D218","v":"Eigen website"},{"$f":"data!E218","v":0},{"$f":"data!F218","v":0},{"$f":"data!G218","v":0}]
[{"$f":"data!A219","v":1001},{"$f":"data!B219","v":"2025"},{"$f":"data!C219","v":0},{"$f":"data!D219","v":"Facebook"},{"$f":"data!E219","v":0},{"$f":"data!F219","v":0},{"$f":"data!G219","v":0}]
[{"$f":"data!A220","v":1001},{"$f":"data!B220","v":"2025"},{"$f":"data!C220","v":0},{"$f":"data!D220","v":"Instagram"},{"$f":"data!E220","v":0},{"$f":"data!F220","v":0},{"$f":"data!G220","v":0}]
[{"$f":"data!A221","v":1001},{"$f":"data!B221","v":"2025"},{"$f":"data!C221","v":0},{"$f":"data!D221","v":"X"},{"$f":"data!E221","v":0},{"$f":"data!F221","v":0},{"$f":"data!G221","v":0}]
[{"$f":"data!A222","v":1001},{"$f":"data!B222","v":"2025"},{"$f":"data!C222","v":0},{"$f":"data!D222","v":"LinkedIn"},{"$f":"data!E222","v":0},{"$f":"data!F222","v":0},{"$f":"data!G222","v":0}]

{"sheet":"beantwoord - niet beantwoord","index":10,"n_rows":56,"n_cols":12,"rows_kept":56,"cut":false,"hidden":true,"merged":[]}
[]
[null,"vraag","beantwoord=1"]
[null,1,{"$f":"Vragenlijst!AS13","v":0},null,1,{"$f":"IF(C3=1,\"ingevuld\",IF(C3=\"nvt\",\"nvt\",\"hier mist iets\"))","v":"hier mist iets"},null,17,{"$f":"IF(C19=1,\"ingevuld\",IF(C19=\"nvt\",\"nvt\",\"hier mist iets\"))","v":"hier mist iets"},null,33,{"$f":"IF(C35=1,\"ingevuld\",IF(C35=\"nvt\",\"nvt\",\"hier mist iets\"))","v":"hier mist iets"}]
[null,2,{"$f":"Vragenlijst!AS15","v":0},null,2,{"$f":"IF(C4=1,\"ingevuld\",IF(C4=\"nvt\",\"nvt\",\"hier mist iets\"))","v":"hier mist iets"},null,18,"hier mist iets",null,34,{"$error":"#VALUE!"}]
[null,3,{"$f":"Vragenlijst!AS22","v":0},null,3,"hier mist iets",null,19,"hier mist iets",null,35,{"$error":"#VALUE!"}]
[null,4,{"$f":"Vragenlijst!AS29","v":0},null,4,"hier mist iets",null,20,"hier mist iets",null,36,"hier mist iets"]
[null,5,{"$f":"Vragenlijst!AS43","v":0},null,5,"hier mist iets",null,21,"hier mist iets",null,37,"hier mist iets"]
[null,6,{"$f":"Vragenlijst!AS53","v":0},null,6,"hier mist iets",null,22,"hier mist iets",null,38,"hier mist iets"]
[null,7,{"$f":"Vragenlijst!AS63","v":0},null,7,"hier mist iets",null,23,"hier mist iets",null,39,"hier mist iets"]
[null,8,{"$f":"Vragenlijst!AS73","v":0},null,8,"hier mist iets",null,24,"hier mist iets",null,40,"hier mist iets"]
[null,9,{"$f":"Vragenlijst!AS120","v":0},null,9,"hier mist iets",null,25,"hier mist iets",null,41,"hier mist iets"]
[null,10,{"$f":"Vragenlijst!AS162","v":0},null,10,"hier mist iets",null,26,"hier mist iets",null,42,"hier mist iets"]
[null,11,{"$f":"Vragenlijst!AS169","v":0},null,11,"hier mist iets",null,27,"hier mist iets",null,43,"hier mist iets"]
[null,12,{"$f":"Vragenlijst!AS186","v":0},null,12,"hier mist iets",null,28,"hier mist iets",null,44,"hier mist iets"]
[null,13,{"$f":"Vragenlijst!AS204","v":0},null,13,"hier mist iets",null,29,"hier mist iets",null,45,"hier mist iets"]
[null,14,{"$f":"Vragenlijst!AS206","v":0},null,14,"hier mist iets",null,30,"hier mist iets",null,46,"hier mist iets"]
[null,15,{"$f":"Vragenlijst!AS215","v":0},null,15,"hier mist iets",null,31,"hier mist iets",null,47,"hier mist iets"]
[null,16,{"$f":"Vragenlijst!AS229","v":{"$error":"#VALUE!"}},null,16,{"$error":"#VALUE!"},null,32,"nvt",null,48,{"$f":"IF(C50=1,\"ingevuld\",IF(C50=\"nvt\",\"nvt\",\"hier mist iets\"))","v":"hier mist iets"}]
[null,17,{"$f":"Vragenlijst!AS254","v":0},null,17,{"$f":"IF(C19=1,\"ingevuld\",IF(C19=\"nvt\",\"nvt\",\"hier mist iets\"))","v":"hier mist iets"}]
[null,18,{"$f":"Vragenlijst!AS268","v":0},null,18,"hier mist iets"]
[null,19,{"$f":"Vragenlijst!AS277","v":0},null,19,"hier mist iets"]
[null,20,{"$f":"Vragenlijst!AS287","v":0},null,20,"hier mist iets"]
[null,21,{"$f":"Vragenlijst!AS289","v":0},null,21,"hier mist iets"]
[null,22,{"$f":"Vragenlijst!AS301","v":0},null,22,"hier mist iets"]
[null,23,{"$f":"Vragenlijst!AS313","v":0},null,23,"hier mist iets"]
[null,24,{"$f":"Vragenlijst!AS331","v":0},null,24,"hier mist iets"]
[null,25,{"$f":"Vragenlijst!AS343","v":0},null,25,"hier mist iets"]
[null,26,{"$f":"Vragenlijst!AS357","v":0},null,26,"hier mist iets"]
[null,27,{"$f":"Vragenlijst!AS373","v":0},null,27,"hier mist iets"]
[null,28,{"$f":"Vragenlijst!AS380","v":0},null,28,"hier mist iets"]
[null,29,{"$f":"Vragenlijst!AS405","v":0},null,29,"hier mist iets"]
[null,30,{"$f":"Vragenlijst!AS414","v":0},null,30,"hier mist iets"]
[null,31,{"$f":"Vragenlijst!AS418","v":0},null,31,"hier mist iets"]
[null,32,{"$f":"Vragenlijst!AS437","v":"nvt"},null,32,"nvt"]
[null,33,{"$f":"Vragenlijst!AS446","v":0},null,33,"hier mist iets"]
[null,34,{"$f":"Vragenlijst!AS462","v":{"$error":"#VALUE!"}},null,34,{"$error":"#VALUE!"}]
[null,35,{"$f":"Vragenlijst!AS479","v":{"$error":"#VALUE!"}},null,35,{"$error":"#VALUE!"}]
[null,36,{"$f":"Vragenlijst!AS496","v":0},null,36,"hier mist iets"]
[null,37,{"$f":"Vragenlijst!AS509","v":0},null,37,"hier mist iets"]
[null,38,{"$f":"Vragenlijst!AS515","v":0},null,38,"hier mist iets"]
[null,39,{"$f":"Vragenlijst!AS536","v":0},null,39,"hier mist iets"]
[null,40,{"$f":"Vragenlijst!AS560","v":0},null,40,"hier mist iets"]
[null,41,{"$f":"Vragenlijst!AS574","v":0},null,41,"hier mist iets"]
[null,42,{"$f":"Vragenlijst!AS585","v":0},null,42,"hier mist iets"]
[null,43,{"$f":"Vragenlijst!AS598","v":0},null,43,"hier mist iets"]
[null,44,{"$f":"Vragenlijst!AS606","v":0},null,44,"hier mist iets"]
[null,45,{"$f":"Vragenlijst!AS615","v":0},null,45,"hier mist iets"]
[null,46,{"$f":"Vragenlijst!AS619","v":0},null,46,"hier mist iets"]
[null,47,{"$f":"Vragenlijst!AS630","v":0},null,47,"hier mist iets"]
[null,48,{"$f":"Vragenlijst!AS646","v":0},null,48,"hier mist iets"]
[null,49,{"$f":"Vragenlijst!AS657","v":0},null,49,"hier mist iets"]
[null,50,{"$f":"Vragenlijst!AS670","v":0},null,50,"hier mist iets"]
[null,51,{"$f":"Vragenlijst!AS674","v":0},null,51,"hier mist iets"]
[null,52,{"$f":"Vragenlijst!AS687","v":0},null,52,"hier mist iets"]
[null,53,{"$f":"Vragenlijst!AS698","v":0},null,53,"hier mist iets"]
[null,54,{"$f":"Vragenlijst!AS706","v":0},null,54,"hier mist iets"]

{"sheet":"linkjes","index":11,"n_rows":46,"n_cols":2,"rows_kept":46,"cut":false,"hidden":true,"merged":[]}
[]
[10,162]
[11,169]
[12,186]
[13,204]
[14,206]
[15,215]
[16,229]
[17,256]
[18,270]
[19,279]
[20,289]
[21,291]
[22,303]
[23,315]
[24,333]
[25,345]
[26,359]
[27,375]
[28,382]
[29,405]
[30,414]
[31,418]
[32,437]
[33,446]
[34,462]
[35,479]
[36,496]
[37,509]
[38,514]
[39,535]
[40,559]
[41,573]
[42,583]
[43,595]
[44,603]
[45,612]
[46,616]
[47,627]
[48,643]
[49,654]
[50,668]
[51,672]
[52,685]
[53,696]
[54,704]

{"sheet":"dataMateriaal","index":12,"n_rows":13,"n_cols":21,"rows_kept":13,"cut":false,"hidden":true,"merged":[]}
[{"$f":"data!A125","v":"id_CA"},{"$f":"data!B125","v":"RapportJaar"},{"$f":"data!C125","v":"invuldatum"},{"$f":"data!D125","v":"Q11_Materiaal"},{"$f":"data!E125","v":"Q11_MilieustraatBS"},{"$f":"data!F125","v":"Q11_KringloopwinkelBS"},{"$f":"data!G125","v":"Q11_RepairCafeBS"},{"$f":"data!H125","v":"Q11_SociaalmaatschappelijkBS"},{"$f":"data!I125","v":"Q11_OnderwijsBS"},{"$f":"data!J125","v":"Q11_WerkplaatsBS"},{"$f":"data!K125","v":"Q11_DeeleconomieBS"},{"$f":"data!L125","v":"Q11_OndernemersBS"},{"$f":"data!M125","v":"Q11_DemontageBS"},{"$f":"data!N125","v":"Q11_AlternatiefElementBS"},{"$f":"data!O125","v":"Q12_DirectHergebruikH"},{"$f":"data!P125","v":"Q12_HergebruikNaReparerenH"},{"$f":"data!Q125","v":"Q12_RepurposeH"},{"$f":"data!R125","v":"Q12_LesmateriaalH"},{"$f":"data!S125","v":"Q12_DemontageVoorHergebruikH"},{"$f":"data!T125","v":"Q12_DemontageVoorRecyclingH"},{"$f":"data!U125","v":"Q12_AndersH"}]
[{"$f":"data!A126","v":1001},{"$f":"data!B126","v":"2025"},{"$f":"data!C126","v":0},{"$f":"data!D126","v":"Elektrische apparaten"},{"$f":"data!E126","v":0},{"$f":"data!F126","v":0},{"$f":"data!G126","v":0},{"$f":"data!H126","v":0},{"$f":"data!I126","v":0},{"$f":"data!J126","v":0},{"$f":"data!K126","v":0},{"$f":"data!L126","v":0},{"$f":"data!M126","v":0},{"$f":"data!N126","v":0},{"$f":"data!O126","v":0},{"$f":"data!P126","v":0},{"$f":"data!Q126","v":0},{"$f":"data!R126","v":0},{"$f":"data!S126","v":0},{"$f":"data!T126","v":0},{"$f":"data!U126","v":0}]
[{"$f":"data!A127","v":1001},{"$f":"data!B127","v":"2025"},{"$f":"data!C127","v":0},{"$f":"data!D127","v":"Fietsen"},{"$f":"data!E127","v":0},{"$f":"data!F127","v":0},{"$f":"data!G127","v":0},{"$f":"data!H127","v":0},{"$f":"data!I127","v":0},{"$f":"data!J127","v":0},{"$f":"data!K127","v":0},{"$f":"data!L127","v":0},{"$f":"data!M127","v":0},{"$f":"data!N127","v":0},{"$f":"data!O127","v":0},{"$f":"data!P127","v":0},{"$f":"data!Q127","v":0},{"$f":"data!R127","v":0},{"$f":"data!S127","v":0},{"$f":"data!T127","v":0},{"$f":"data!U127","v":0}]
[{"$f":"data!A128","v":1001},{"$f":"data!B128","v":"2025"},{"$f":"data!C128","v":0},{"$f":"data!D128","v":"Meubilair en onderdelen"},{"$f":"data!E128","v":0},{"$f":"data!F128","v":0},{"$f":"data!G128","v":0},{"$f":"data!H128","v":0},{"$f":"data!I128","v":0},{"$f":"data!J128","v":0},{"$f":"data!K128","v":0},{"$f":"data!L128","v":0},{"$f":"data!M128","v":0},{"$f":"data!N128","v":0},{"$f":"data!O128","v":0},{"$f":"data!P128","v":0},{"$f":"data!Q128","v":0},{"$f":"data!R128","v":0},{"$f":"data!S128","v":0},{"$f":"data!T128","v":0},{"$f":"data!U128","v":0}]
[{"$f":"data!A129","v":1001},{"$f":"data!B129","v":"2025"},{"$f":"data!C129","v":0},{"$f":"data!D129","v":"Textiel"},{"$f":"data!E129","v":0},{"$f":"data!F129","v":0},{"$f":"data!G129","v":0},{"$f":"data!H129","v":0},{"$f":"data!I129","v":0},{"$f":"data!J129","v":0},{"$f":"data!K129","v":0},{"$f":"data!L129","v":0},{"$f":"data!M129","v":0},{"$f":"data!N129","v":0},{"$f":"data!O129","v":0},{"$f":"data!P129","v":0},{"$f":"data!Q129","v":0},{"$f":"data!R129","v":0},{"$f":"data!S129","v":0},{"$f":"data!T129","v":0},{"$f":"data!U129","v":0}]
[{"$f":"data!#REF!","v":{"$error":"#REF!"}},{"$f":"data!#REF!","v":{"$error":"#REF!"}},{"$f":"data!#REF!","v":{"$error":"#REF!"}},{"$f":"data!#REF!","v":{"$error":"#REF!"}},{"$f":"data!#REF!","v":{"$error":"#REF!"}},{"$f":"data!#REF!","v":{"$error":"#REF!"}},{"$f":"data!#REF!","v":{"$error":"#REF!"}},{"$f":"data!#REF!","v":{"$error":"#REF!"}},{"$f":"data!#REF!","v":{"$error":"#REF!"}},{"$f":"data!#REF!","v":{"$error":"#REF!"}},{"$f":"data!#REF!","v":{"$error":"#REF!"}},{"$f":"data!#REF!","v":{"$error":"#REF!"}},{"$f":"data!#REF!","v":{"$error":"#REF!"}},{"$f":"data!#REF!","v":{"$error":"#REF!"}},{"$f":"data!#REF!","v":{"$error":"#REF!"}},{"$f":"data!#REF!","v":{"$error":"#REF!"}},{"$f":"data!#REF!","v":{"$error":"#REF!"}},{"$f":"data!#REF!","v":{"$error":"#REF!"}},{"$f":"data!#REF!","v":{"$error":"#REF!"}},{"$f":"data!#REF!","v":{"$error":"#REF!"}},{"$f":"data!#REF!","v":{"$error":"#REF!"}}]
[{"$f":"data!A130","v":1001},{"$f":"data!B130","v":"2025"},{"$f":"data!C130","v":0},{"$f":"data!D130","v":"Metaal / staal"},{"$f":"data!E130","v":0},{"$f":"data!F130","v":0},{"$f":"data!G130","v":0},{"$f":"data!H130","v":0},{"$f":"data!I130","v":0},{"$f":"data!J130","v":0},{"$f":"data!K130","v":0},{"$f":"data!L130","v":0},{"$f":"data!M130","v":0},{"$f":"data!N130","v":0},{"$f":"data!O130","v":0},{"$f":"data!P130","v":0},{"$f":"data!Q130","v":0},{"$f":"data!R130","v":0},{"$f":"data!S130","v":0},{"$f":"data!T130","v":0},{"$f":"data!U130","v":0}]
[{"$f":"data!A131","v":1001},{"$f":"data!B131","v":"2025"},{"$f":"data!C131","v":0},{"$f":"data!D131","v":"Hout (balken, plaatmateriaal)"},{"$f":"data!E131","v":0},{"$f":"data!F131","v":0},{"$f":"data!G131","v":0},{"$f":"data!H131","v":0},{"$f":"data!I131","v":0},{"$f":"data!J131","v":0},{"$f":"data!K131","v":0},{"$f":"data!L131","v":0},{"$f":"data!M131","v":0},{"$f":"data!N131","v":0},{"$f":"data!O131","v":0},{"$f":"data!P131","v":0},{"$f":"data!Q131","v":0},{"$f":"data!R131","v":0},{"$f":"data!S131","v":0},{"$f":"data!T131","v":0},{"$f":"data!U131","v":0}]
[{"$f":"data!A132","v":1001},{"$f":"data!B132","v":"2025"},{"$f":"data!C132","v":0},{"$f":"data!D132","v":"Overige bouwmaterialen (anders dan hout en metaal)"},{"$f":"data!E132","v":0},{"$f":"data!F132","v":0},{"$f":"data!G132","v":0},{"$f":"data!H132","v":0},{"$f":"data!I132","v":0},{"$f":"data!J132","v":0},{"$f":"data!K132","v":0},{"$f":"data!L132","v":0},{"$f":"data!M132","v":0},{"$f":"data!N132","v":0},{"$f":"data!O132","v":0},{"$f":"data!P132","v":0},{"$f":"data!Q132","v":0},{"$f":"data!R132","v":0},{"$f":"data!S132","v":0},{"$f":"data!T132","v":0},{"$f":"data!U132","v":0}]
[{"$f":"data!A133","v":1001},{"$f":"data!B133","v":"2025"},{"$f":"data!C133","v":0},{"$f":"data!D133","v":0},{"$f":"data!E133","v":0},{"$f":"data!F133","v":0},{"$f":"data!G133","v":0},{"$f":"data!H133","v":0},{"$f":"data!I133","v":0},{"$f":"data!J133","v":0},{"$f":"data!K133","v":0},{"$f":"data!L133","v":0},{"$f":"data!M133","v":0},{"$f":"data!N133","v":0},{"$f":"data!O133","v":0},{"$f":"data!P133","v":0},{"$f":"data!Q133","v":0},{"$f":"data!R133","v":0},{"$f":"data!S133","v":0},{"$f":"data!T133","v":0},{"$f":"data!U133","v":0}]
[{"$f":"data!A134","v":1001},{"$f":"data!B134","v":"2025"},{"$f":"data!C134","v":0},{"$f":"data!D134","v":0},{"$f":"data!E134","v":0},{"$f":"data!F134","v":0},{"$f":"data!G134","v":0},{"$f":"data!H134","v":0},{"$f":"data!I134","v":0},{"$f":"data!J134","v":0},{"$f":"data!K134","v":0},{"$f":"data!L134","v":0},{"$f":"data!M134","v":0},{"$f":"data!N134","v":0},{"$f":"data!O134","v":0},{"$f":"data!P134","v":0},{"$f":"data!Q134","v":0},{"$f":"data!R134","v":0},{"$f":"data!S134","v":0},{"$f":"data!T134","v":0},{"$f":"data!U134","v":0}]
[{"$f":"data!A135","v":1001},{"$f":"data!B135","v":"2025"},{"$f":"data!C135","v":0},{"$f":"data!D135","v":0},{"$f":"data!E135","v":0},{"$f":"data!F135","v":0},{"$f":"data!G135","v":0},{"$f":"data!H135","v":0},{"$f":"data!I135","v":0},{"$f":"data!J135","v":0},{"$f":"data!K135","v":0},{"$f":"data!L135","v":0},{"$f":"data!M135","v":0},{"$f":"data!N135","v":0},{"$f":"data!O135","v":0},{"$f":"data!P135","v":0},{"$f":"data!Q135","v":0},{"$f":"data!R135","v":0},{"$f":"data!S135","v":0},{"$f":"data!T135","v":0},{"$f":"data!U135","v":0}]
[{"$f":"data!A136","v":1001},{"$f":"data!B136","v":"2025"},{"$f":"data!C136","v":0},{"$f":"data!D136","v":0},{"$f":"data!E136","v":0},{"$f":"data!F136","v":0},{"$f":"data!G136","v":0},{"$f":"data!H136","v":0},{"$f":"data!I136","v":0},{"$f":"data!J136","v":0},{"$f":"data!K136","v":0},{"$f":"data!L136","v":0},{"$f":"data!M136","v":0},{"$f":"data!N136","v":0},{"$f":"data!O136","v":0},{"$f":"data!P136","v":0},{"$f":"data!Q136","v":0},{"$f":"data!R136","v":0},{"$f":"data!S136","v":0},{"$f":"data!T136","v":0},{"$f":"data!U136","v":0}]

{"sheet":"dataReparatie","index":13,"n_rows":7,"n_cols":8,"rows_kept":7,"cut":false,"hidden":true,"merged":[]}
[{"$f":"data!A152","v":"id_CA"},{"$f":"data!B152","v":"RapportJaar"},{"$f":"data!C152","v":"invuldatum"},{"$f":"data!D152","v":"Q17_Reparatieorganiatie"},{"$f":"data!E152","v":"Q17_Aanwezig"},{"$f":"data!F152","v":"Q17_Particulieren"},{"$f":"data!G152","v":"Q17_Zakelijk"},{"$f":"data!H152","v":"Q17_AndersNamelijk"}]
[{"$f":"data!A153","v":1001},{"$f":"data!B153","v":"2025"},{"$f":"data!C153","v":0},{"$f":"data!D153","v":"RepairCafé"},{"$f":"data!E153","v":{"$error":"#VALUE!"}},{"$f":"data!F153","v":0},{"$f":"data!G153","v":0},{"$f":"data!H153","v":0}]
[{"$f":"data!A154","v":1001},{"$f":"data!B154","v":"2025"},{"$f":"data!C154","v":0},{"$f":"data!D154","v":"SociaalDomein"},{"$f":"data!E154","v":{"$error":"#VALUE!"}},{"$f":"data!F154","v":0},{"$f":"data!G154","v":0},{"$f":"data!H154","v":0}]
[{"$f":"data!A155","v":1001},{"$f":"data!B155","v":"2025"},{"$f":"data!C155","v":0},{"$f":"data!D155","v":"Kringloop"},{"$f":"data!E155","v":{"$error":"#VALUE!"}},{"$f":"data!F155","v":0},{"$f":"data!G155","v":0},{"$f":"data!H155","v":0}]
[{"$f":"data!A156","v":1001},{"$f":"data!B156","v":"2025"},{"$f":"data!C156","v":0},{"$f":"data!D156","v":"CommercieelReparatiebedrijf"},{"$f":"data!E156","v":{"$error":"#VALUE!"}},{"$f":"data!F156","v":0},{"$f":"data!G156","v":0},{"$f":"data!H156","v":0}]
[{"$f":"data!A157","v":1001},{"$f":"data!B157","v":"2025"},{"$f":"data!C157","v":0},{"$f":"data!D157","v":"DIY"},{"$f":"data!E157","v":{"$error":"#VALUE!"}},{"$f":"data!F157","v":0},{"$f":"data!G157","v":0},{"$f":"data!H157","v":0}]
[{"$f":"data!A158","v":1001},{"$f":"data!B158","v":"2025"},{"$f":"data!C158","v":0},{"$f":"data!D158","v":"Anders"},{"$f":"data!E158","v":{"$error":"#VALUE!"}},{"$f":"data!F158","v":0},{"$f":"data!G158","v":0},{"$f":"data!H158","v":0}]

{"sheet":"DataBekendheid","index":14,"n_rows":6,"n_cols":7,"rows_kept":6,"cut":false,"hidden":true,"merged":[]}
[{"$f":"data!A217","v":"id_CA"},{"$f":"data!B217","v":"RapportJaar"},{"$f":"data!C217","v":"invuldatum"},{"$f":"data!D217","v":"Q47_TypePresentie"},{"$f":"data!E217","v":"Q47_bestaat"},{"$f":"data!F217","v":"Q47_Link"},{"$f":"data!G217","v":"Q47_Bezoekers/Volgers"}]
[{"$f":"data!A218","v":1001},{"$f":"data!B218","v":"2025"},{"$f":"data!C218","v":0},{"$f":"data!D218","v":"Eigen website"},{"$f":"data!E218","v":0},{"$f":"data!F218","v":0},{"$f":"data!G218","v":0}]
[{"$f":"data!A219","v":1001},{"$f":"data!B219","v":"2025"},{"$f":"data!C219","v":0},{"$f":"data!D219","v":"Facebook"},{"$f":"data!E219","v":0},{"$f":"data!F219","v":0},{"$f":"data!G219","v":0}]
[{"$f":"data!A220","v":1001},{"$f":"data!B220","v":"2025"},{"$f":"data!C220","v":0},{"$f":"data!D220","v":"Instagram"},{"$f":"data!E220","v":0},{"$f":"data!F220","v":0},{"$f":"data!G220","v":0}]
[{"$f":"data!A221","v":1001},{"$f":"data!B221","v":"2025"},{"$f":"data!C221","v":0},{"$f":"data!D221","v":"X"},{"$f":"data!E221","v":0},{"$f":"data!F221","v":0},{"$f":"data!G221","v":0}]
[{"$f":"data!A222","v":1001},{"$f":"data!B222","v":"2025"},{"$f":"data!C222","v":0},{"$f":"data!D222","v":"LinkedIn"},{"$f":"data!E222","v":0},{"$f":"data!F222","v":0},{"$f":"data!G222","v":0}]